{"text_format":"1","workbook":"xlsx","n_sheets":9,"sheets":["PSICFL Rec","Request_Info","Lookups","DOE Codes Lookups","1920 PSICFL","Codes Master","Certifications","SOC Lookups","SOC Codes"],"not_rendered":{"charts":0,"images":0,"macros":1,"external_links":0,"defined_names":45,"comments":0,"pivot_tables":0},"unopened":[],"bounds":{"document_bytes":16777216,"sheet_cells":100000,"rows_first":2000,"rows_last":500,"rows_between":2000,"halvings":0,"cell_chars":16384,"cell_head_chars":4096},"cells_cut":0,"cells_raw":0,"read":"whole","date_system":"1900"}

{"sheet":"PSICFL Rec","index":0,"n_rows":48,"n_cols":19,"rows_kept":48,"cut":false,"hidden":false,"merged":[[30,0,33,0],[40,1,40,12],[29,4,29,12],[41,1,41,12],[39,11,39,12],[37,1,37,3],[37,4,37,12],[36,4,36,12],[34,1,34,12],[35,1,35,3],[36,1,36,3],[38,1,38,12],[33,1,33,3],[0,0,0,12],[1,0,1,12],[13,1,13,2],[17,1,17,12],[22,1,22,12],[19,1,19,3],[10,0,16,0],[17,0,25,0],[10,1,10,12],[12,1,12,2],[3,0,3,12],[4,0,4,12],[5,0,6,12],[7,0,7,12],[8,0,8,12],[20,4,20,12],[20,1,20,3],[18,4,18,12],[19,4,19,12],[16,1,16,2],[9,0,9,12],[12,3,12,12],[11,1,11,2],[18,1,18,3],[15,1,15,2],[11,3,11,12],[13,3,13,12],[15,3,15,12],[14,3,14,12],[14,1,14,2],[16,3,16,12],[21,4,21,9],[45,1,45,12],[26,0,29,0],[39,1,39,10],[23,1,23,3],[23,4,23,12],[24,1,24,3],[24,4,24,12],[25,4,25,12],[32,4,32,12],[43,1,43,12],[42,1,42,12],[35,4,35,12],[44,1,44,12],[32,1,32,3],[34,0,37,0],[47,0,47,12],[33,4,33,12],[21,1,21,3],[25,1,25,3],[21,10,21,11],[26,1,26,12],[30,1,30,12],[31,1,31,3],[31,4,31,12],[27,1,27,3],[27,4,27,12],[29,1,29,3],[46,0,46,12],[28,1,28,3],[28,4,28,12],[38,0,45,0]]}
["Recommendation Form"]
["2020-21 CAPE Postsecondary Industry Certification Funding List \nFlorida Department of Education"]
[]
["This form is to be used to recommend an industry certification for inclusion on the CAPE Postsecondary Industry Certification Funding List, which will be reviewed by the State Board of Education. "]
["Directions:"]
["1. Save this form using the following naming convention: PSICFL_Agency Name_Certification Name.xls \n2. Complete the form. (Incomplete forms will not be reviewed.) \n3. Use a separate form for each recommendation. \n4. Submit additional supplemental materials as needed in an electronic format with the recommendation form. \n5. Email your recommendations as an Excel attachment to industrycertification@fldoe.org."]
[]
["All forms must be submitted by May 29, 2020 for consideration."]
["For technical questions, please contact Kathryn Wheeler at 850-245-9030. "]
[]
["Step 1","Submitter Information\nPlease tell us about yourself."]
[null,"Type of Submitter",null,"_",null,null,null,null,null,null,null,null,null,null,{"$f":"IF(OR(O19>1,E24<>\"\"),1,0)","v":0},"Check of cert listed",null,{"$f":"IF(D12=\"_\",0,1)","v":0},{"$f":"COUNTIF(R12:R17,0)","v":5}]
[null,"Name",null,null,null,null,null,null,null,null,null,null,null,null,null,null,null,{"$f":"IF(D13=\"\",0,1)","v":0}]
[null,"Title",null,null,null,null,null,null,null,null,null,null,null,null,{"$f":"IF(AND(O12>0,S12>0),\"Step 1\",\"\")","v":""},"Step 1 check",null,{"$f":"IF(D14=\"\",0,1)","v":0}]
[null,"Agency/Institution",null,null,null,null,null,null,null,null,null,null,null,{"$f":"VLOOKUP(D15,Agency_LKP,2,FALSE)","v":{"$error":"#N/A"}},null,null,null,{"$f":"IF(N15<2,0,1)","v":{"$error":"#N/A"}}]
[null,"Phone Number",null,null,null,null,null,null,null,null,null,null,null,null,null,null,null,{"$f":"IF(D16=\"\",0,1)","v":0}]
[null,"E-mail Address",null,null,null,null,null,null,null,null,null,null,null,null,null,null,null,{"$f":"IF(D17=\"\",0,1)","v":0}]
["Step 2","Recommendation for Certifications with a DOE Code \nPlease use the drop-down menu below to determine if the certification/license already exists in the Department's Industry Certification database. A complete list can also be found on the Certifications tab below."]
[null,"Certification Code/Title",null,null,"_",null,null,null,null,null,null,null,null,{"$f":"VLOOKUP(E19,Cert_Lookup,4,FALSE)","v":1},{"$f":"VLOOKUP(E19,Cert_Lookup,4,FALSE)","v":1}]
[null,"Certifying Agency",null,null,{"$f":"VLOOKUP(O19,Cert_Agency,2,FALSE)","v":"_"},null,null,null,null,null,null,null,null,null,null,"Step 2 Check"]
{"$rows_left_out":29}
{"sheet":"Request_Info","index":1,"n_rows":4,"n_cols":27,"rows_kept":4,"cut":false,"hidden":true,"merged":[]}
[null,"Type of Submitter","Name","Title","Agency","Phone Number","Email","Cert Code","Cert Title","Cert Agency","Agency Website","Add funding eligiblity","SOC1","SOC2","SOC3","Area College","Area District","Evidence_TOL","Prog1","Prog2","Prog3","3rd Party","Exam Req","Other Req","Work Exp","Date Received","Review window"]
[null,{"$f":"'PSICFL Rec'!D12","v":"_"},{"$f":"'PSICFL Rec'!D13","v":0},{"$f":"'PSICFL Rec'!D14","v":0},{"$f":"'PSICFL Rec'!D15","v":0},{"$f":"'PSICFL Rec'!D16","v":0},{"$f":"'PSICFL Rec'!D17","v":0},{"$f":"IF('PSICFL Rec'!O19>1,VLOOKUP('PSICFL Rec'!O19,Certs,2,FALSE),\"\")","v":""},{"$f":"IF('PSICFL Rec'!O19>1,VLOOKUP('PSICFL Rec'!O19,Certs,4,FALSE),'PSICFL Rec'!E24)","v":0},{"$f":"IF('PSICFL Rec'!O19>1,VLOOKUP('PSICFL Rec'!O19,Certs,7,FALSE),'PSICFL Rec'!E25)","v":0},{"$f":"IF('PSICFL Rec'!O19>1,VLOOKUP('PSICFL Rec'!O19,Certs,8,FALSE),'PSICFL Rec'!E26)","v":0},{"$f":"'PSICFL Rec'!N22","v":"_"},{"$f":"'PSICFL Rec'!E32","v":"_"},{"$f":"'PSICFL Rec'!E33","v":"_"},{"$f":"'PSICFL Rec'!E34","v":"_"},{"$f":"'PSICFL Rec'!E28","v":"_"},{"$f":"'PSICFL Rec'!E29","v":"_"},{"$f":"'PSICFL Rec'!E30","v":0},{"$f":"'PSICFL Rec'!E36","v":0},{"$f":"'PSICFL Rec'!E37","v":0},{"$f":"'PSICFL Rec'!E38","v":0},{"$f":"'PSICFL Rec'!L40","v":"_"},{"$f":"'PSICFL Rec'!B42","v":0},{"$f":"'PSICFL Rec'!B44","v":0},{"$f":"'PSICFL Rec'!B46","v":0},{"$f":"TODAY()","v":"2020-04-06"},"2020-21"]
[]
[null,{"$f":"IF(B2=\"_\",\"\",B2)","v":""},{"$f":"C2","v":0},0,0,0,0,"",0,0,0,"_",{"$f":"VLOOKUP(M2,SOCReturn,2,FALSE)","v":0},{"$f":"VLOOKUP(N2,SOCReturn,2,FALSE)","v":0},{"$f":"VLOOKUP(O2,SOCReturn,2,FALSE)","v":0},{"$f":"IF(P2=\"_\",\"\",P2)","v":""},{"$f":"IF(Q2=\"_\",\"\",Q2)","v":""},{"$f":"R2","v":0},0,0,0,"_",0,0,0,"2020-04-06","2020-21"]

{"sheet":"Lookups","index":2,"n_rows":99,"n_cols":6,"rows_kept":99,"cut":false,"hidden":true,"merged":[]}
[]
[null,"Agency Name"]
[1,"Select an agency name",1,null,"_"]
[2,"Alachua",2,null,"Yes"]
[3,"Baker",3,null,"No"]
[4,"Bay",4]
[5,"Bradford",5]
[6,"Brevard",6,null,"_"]
[7,"Broward",7,null,"Florida College System Institution"]
[8,"Broward College",8,null,"District Postsecondary Institution"]
[9,"Calhoun",9]
[10,"Charlotte",10]
[11,"Chipola College",11]
[12,"Citrus",12]
[13,"Clay",13]
[14,"College of Central Florida",14]
[15,"Collier",15]
[16,"Columbia",16]
[17,"Daytona State College",17,null,"_"]
[18,"DeSoto",18,null,"Advanced manufacturing"]
{"$rows_left_out":80}
{"sheet":"DOE Codes Lookups","index":3,"n_rows":836,"n_cols":8,"rows_kept":836,"cut":false,"hidden":true,"merged":[]}
[null,"DOE Code",null,"Certification Title","Status",null,"Certification Agency","Agency Website"]
[1,null,"_","_","_",1,"_","_"]
[2,"AAMIN001","(AAMIN001) Certified Biomedical Equipment Technician","Certified Biomedical Equipment Technician",4,2,"Association for the Advancement of Medical Instrumentation (AAMI)",{"$f":"VLOOKUP(B3,Certifications!$A$2:$D$844,4,FALSE)","v":"www.aami.org/certification/"}]
[3,"AAVSB001","(AAVSB001) Veterinary Technician","Veterinary Technician",1,3,"American Association of Veterinary State Boards",{"$f":"VLOOKUP(B4,Certifications!$A$2:$D$844,4,FALSE)","v":"www.aavsb.org/"}]
[4,"ABAYC001","(ABAYC001) Composite Boat Builder Certification","Composite Boat Builder Certification",2,4,"American Boat & Yacht Council",{"$f":"VLOOKUP(B5,Certifications!$A$2:$D$844,4,FALSE)","v":"www.abycinc.org/"}]
[5,"ABAYC002","(ABAYC002) Marine Diesel Certification","Marine Diesel Certification",1,5,"American Boat & Yacht Council",{"$f":"VLOOKUP(B6,Certifications!$A$2:$D$844,4,FALSE)","v":"www.abycinc.org/"}]
[6,"ABAYC003","(ABAYC003) Marine Electrical Certification","Marine Electrical Certification",2,6,"American Boat & Yacht Council",{"$f":"VLOOKUP(B7,Certifications!$A$2:$D$844,4,FALSE)","v":"www.abycinc.org/"}]
[7,"ABAYC005","(ABAYC005) Marine Systems Certification","Marine Systems Certification",1,7,"American Boat & Yacht Council",{"$f":"VLOOKUP(B8,Certifications!$A$2:$D$844,4,FALSE)","v":"www.abycinc.org/"}]
[8,"ABAYC006","(ABAYC006) A/C Refrigeration Certification","A/C Refrigeration Certification",2,8,"American Boat & Yacht Council",{"$f":"VLOOKUP(B9,Certifications!$A$2:$D$844,4,FALSE)","v":"www.abycinc.org/"}]
[9,"ABAYC007","(ABAYC007) Marine Corrosion Certification","Marine Corrosion Certification",1,9,"American Boat & Yacht Council",{"$f":"VLOOKUP(B10,Certifications!$A$2:$D$844,4,FALSE)","v":"www.abycinc.org/"}]
[10,"ABCOP001","(ABCOP001) Certified Prosthetic (and/or) Orthotic Technician (CTPO)","Certified Prosthetic (and/or) Orthotic Technician (CTPO)",4,10,"American Board for Certification in Orthotics, Prosthetics & Pedorthics",{"$f":"VLOOKUP(B11,Certifications!$A$2:$D$844,4,FALSE)","v":"www.abcop.org"}]
[11,"ABRET001","(ABRET001) Registered EEG Technologist (R. EEG T.)","Registered EEG Technologist (R. EEG T.)",1,11,"American Board of Registration of Electroencephalographic and Evoked Potential Technologists",{"$f":"VLOOKUP(B12,Certifications!$A$2:$D$844,4,FALSE)","v":"www.abret.org/"}]
[12,"ACFAT001","(ACFAT001) Accredited Business Accountant (ABA)","Accredited Business Accountant (ABA)",1,12,"Accreditation Council for Accountancy & Taxation",{"$f":"VLOOKUP(B13,Certifications!$A$2:$D$844,4,FALSE)","v":"www.acatcredentials.org"}]
[13,"ACFED001","(ACFED001) Certified Chef de Cuisine","Certified Chef de Cuisine",1,13,"American Culinary Federation",{"$f":"VLOOKUP(B14,Certifications!$A$2:$D$844,4,FALSE)","v":"www.acfchefs.org"}]
[14,"ACFED002","(ACFED002) Certified Culinarian (CC)","Certified Culinarian (CC)",1,14,"American Culinary Federation",{"$f":"VLOOKUP(B15,Certifications!$A$2:$D$844,4,FALSE)","v":"www.acfchefs.org"}]
[15,"ACFED006","(ACFED006) Certified Fundamentals Cook","Certified Fundamentals Cook",1,15,"American Culinary Federation",{"$f":"VLOOKUP(B16,Certifications!$A$2:$D$844,4,FALSE)","v":"www.acfchefs.org"}]
[16,"ACOPC001","(ACOPC001) Certified Professional Coder (CPC - Apprentice)","Certified Professional Coder (CPC - Apprentice)",1,16,"American Academy of Professional Coders",{"$f":"VLOOKUP(B17,Certifications!$A$2:$D$844,4,FALSE)","v":"www.aapc.com/"}]
[17,"ACOPC004","(ACOPC004) Certified Outpatient Coder (COC)","Certified Outpatient Coder (COC)",2,17,"American Academy of Professional Coders",{"$f":"VLOOKUP(B18,Certifications!$A$2:$D$844,4,FALSE)","v":"www.aapc.com/"}]
[18,"ACOPC005","(ACOPC005) Certified Professional Coder - Payer (CPC-P)","Certified Professional Coder - Payer (CPC-P)",2,18,"American Academy of Professional Coders",{"$f":"VLOOKUP(B19,Certifications!$A$2:$D$844,4,FALSE)","v":"www.aapc.com/"}]
[19,"ACOPC006","(ACOPC006) Certified Professional Coder (CPC)","Certified Professional Coder (CPC)",2,19,"American Academy of Professional Coders",{"$f":"VLOOKUP(B20,Certifications!$A$2:$D$844,4,FALSE)","v":"www.aapc.com/"}]
{"$rows_left_out":817}
{"sheet":"1920 PSICFL","index":4,"n_rows":273,"n_cols":6,"rows_kept":273,"cut":false,"hidden":true,"merged":[]}
["DOE Code","PSICFL","Eligible for College Performance Incentive Funds2","College Performance Funding Area","Eligible for District Performance Incentive Funds3","District Performance Funding Area"]
["AAMIN001","Yes","Yes","Health Sciences","No"]
["ABAYC001","Yes","Yes","Advanced manufacturing","Yes","Advanced manufacturing"]
["ABAYC003","Yes","Yes","Electrician","Yes","Electrician"]
["ABAYC006","Yes","Yes","Heating, ventilation and air conditioning technician","Yes","Heating, ventilation and air conditioning technician"]
["ABCOP001","Yes","Yes","Health Sciences","No"]
["ACOPC004","Yes","Yes","Health Sciences","Yes","Health Sciences - Medical coder/biller"]
["ACOPC005","Yes","Yes","Health Sciences","Yes","Health Sciences - Medical coder/biller"]
["ACOPC006","Yes","Yes","Health Sciences","Yes","Health Sciences - Medical coder/biller"]
["ACOPC007","Yes","Yes","Health Sciences","Yes","Health Sciences - Medical coder/biller"]
["ACSMD002","Yes","Yes","Health Sciences","No"]
["ADESK021","Yes","No",null,"Yes","Computer-aided drafting"]
["ADESK023","Yes","No",null,"Yes","Computer-aided drafting"]
["ADESK024","Yes","No",null,"Yes","Computer-aided drafting"]
["ADESK025","Yes","No",null,"Yes","Computer-aided drafting"]
["AFHDI001","Yes","Yes","Health Sciences","No"]
["AFHDI002","Yes","Yes","Health Sciences","No"]
["AHIMA001","Yes","Yes","Health Sciences","Yes","Health Sciences - Medical coder/biller"]
["AHIMA002","Yes","Yes","Health Sciences","Yes","Health Sciences - Medical coder/biller"]
["AHIMA003","Yes","Yes","Health Sciences","Yes","Health Sciences - Medical coder/biller"]
{"$rows_left_out":254}
{"sheet":"Codes Master","index":5,"n_rows":916,"n_cols":11,"rows_kept":916,"cut":false,"hidden":true,"merged":[]}
[null,"Cert_Code","Form Lookup Box","Cert_Title","Status",null,"Cert_Agency_Name","PSICFL","PSICFL FE District","PSICFL FE College"]
[1,"AAMIN001",{"$f":"CONCATENATE(\"(\",B2,\") \",D2)","v":"(AAMIN001) Certified Biomedical Equipment Technician"},"Certified Biomedical Equipment Technician",{"$f":"IF(H2=\"no\",\"1\",IF(AND(H2=\"Yes\",I2=\"No\",J2=\"No\"),\"3\",IF(AND(H2=\"Yes\",I2=\"Yes\",J2=\"Yes\"),\"2\",IF(AND(H2=\"Yes\",I2=\"Yes\",J2=\"No\"),\"5\",IF(AND(H2=\"Yes\",I2=\"No\",J2=\"Yes\"),\"4\",\"0\")))))","v":"4"},1,"Association for the Advancement of Medical Instrumentation (AAMI)",{"$f":"IFERROR(VLOOKUP(B2,PSICFL_1819a,2,FALSE),\"No\")","v":"Yes"},{"$f":"IFERROR(VLOOKUP(B2,PSICFL_1819a,5,FALSE),\"No\")","v":"No"},{"$f":"IFERROR(VLOOKUP(B2,PSICFL_1819a,3,FALSE),\"No\")","v":"Yes"},{"$f":"VLOOKUP(B2,'DOE Codes Lookups'!$A$3:$D$507,2,FALSE)","v":{"$error":"#N/A"}}]
[2,"AAVSB001","(AAVSB001) Veterinary Technician","Veterinary Technician","1",2,"American Association of Veterinary State Boards","No","No","No",{"$f":"VLOOKUP(B3,'DOE Codes Lookups'!$A$3:$D$507,2,FALSE)","v":{"$error":"#N/A"}}]
[3,"ABAYC001","(ABAYC001) Composite Boat Builder Certification","Composite Boat Builder Certification","2",3,"American Boat & Yacht Council","Yes","Yes","Yes",{"$f":"VLOOKUP(B4,'DOE Codes Lookups'!$A$3:$D$507,2,FALSE)","v":{"$error":"#N/A"}}]
[4,"ABAYC002","(ABAYC002) Marine Diesel Certification","Marine Diesel Certification","1",4,"American Boat & Yacht Council","No","No","No",{"$f":"VLOOKUP(B5,'DOE Codes Lookups'!$A$3:$D$507,2,FALSE)","v":{"$error":"#N/A"}}]
[5,"ABAYC003","(ABAYC003) Marine Electrical Certification","Marine Electrical Certification","2",5,"American Boat & Yacht Council","Yes","Yes","Yes",{"$f":"VLOOKUP(B6,'DOE Codes Lookups'!$A$3:$D$507,2,FALSE)","v":{"$error":"#N/A"}}]
[6,"ABAYC005","(ABAYC005) Marine Systems Certification","Marine Systems Certification","1",6,"American Boat & Yacht Council","No","No","No",{"$f":"VLOOKUP(B7,'DOE Codes Lookups'!$A$3:$D$507,2,FALSE)","v":{"$error":"#N/A"}}]
[7,"ABAYC006","(ABAYC006) A/C Refrigeration Certification","A/C Refrigeration Certification","2",7,"American Boat & Yacht Council","Yes","Yes","Yes",{"$f":"VLOOKUP(B8,'DOE Codes Lookups'!$A$3:$D$507,2,FALSE)","v":{"$error":"#N/A"}}]
[8,"ABAYC007","(ABAYC007) Marine Corrosion Certification","Marine Corrosion Certification","1",8,"American Boat & Yacht Council","No","No","No",{"$f":"VLOOKUP(B9,'DOE Codes Lookups'!$A$3:$D$507,2,FALSE)","v":{"$error":"#N/A"}}]
[9,"ABCOP001","(ABCOP001) Certified Prosthetic (and/or) Orthotic Technician (CTPO)","Certified Prosthetic (and/or) Orthotic Technician (CTPO)","4",9,"American Board for Certification in Orthotics, Prosthetics & Pedorthics","Yes","No","Yes",{"$f":"VLOOKUP(B10,'DOE Codes Lookups'!$A$3:$D$507,2,FALSE)","v":{"$error":"#N/A"}}]
[10,"ABRET001","(ABRET001) Registered EEG Technologist (R. EEG T.)","Registered EEG Technologist (R. EEG T.)","1",10,"American Board of Registration of Electroencephalographic and Evoked Potential Technologists","No","No","No",{"$f":"VLOOKUP(B11,'DOE Codes Lookups'!$A$3:$D$507,2,FALSE)","v":{"$error":"#N/A"}}]
[11,"ACFAT001","(ACFAT001) Accredited Business Accountant (ABA)","Accredited Business Accountant (ABA)","1",11,"Accreditation Council for Accountancy & Taxation","No","No","No",{"$f":"VLOOKUP(B12,'DOE Codes Lookups'!$A$3:$D$507,2,FALSE)","v":{"$error":"#N/A"}}]
[12,"ACFED001","(ACFED001) Certified Chef de Cuisine","Certified Chef de Cuisine","1",12,"American Culinary Federation","No","No","No",{"$f":"VLOOKUP(B13,'DOE Codes Lookups'!$A$3:$D$507,2,FALSE)","v":{"$error":"#N/A"}}]
[13,"ACFED002","(ACFED002) Certified Culinarian (CC)","Certified Culinarian (CC)","1",13,"American Culinary Federation","No","No","No",{"$f":"VLOOKUP(B14,'DOE Codes Lookups'!$A$3:$D$507,2,FALSE)","v":{"$error":"#N/A"}}]
[14,"ACFED006","(ACFED006) Certified Fundamentals Cook","Certified Fundamentals Cook","1",14,"American Culinary Federation","No","No","No",{"$f":"VLOOKUP(B15,'DOE Codes Lookups'!$A$3:$D$507,2,FALSE)","v":{"$error":"#N/A"}}]
[15,"ACOPC001","(ACOPC001) Certified Professional Coder (CPC - Apprentice)","Certified Professional Coder (CPC - Apprentice)","1",15,"American Academy of Professional Coders","No","No","No",{"$f":"VLOOKUP(B16,'DOE Codes Lookups'!$A$3:$D$507,2,FALSE)","v":{"$error":"#N/A"}}]
[16,"ACOPC004","(ACOPC004) Certified Outpatient Coder (COC)","Certified Outpatient Coder (COC)","2",16,"American Academy of Professional Coders","Yes","Yes","Yes",{"$f":"VLOOKUP(B17,'DOE Codes Lookups'!$A$3:$D$507,2,FALSE)","v":{"$error":"#N/A"}}]
[17,"ACOPC005","(ACOPC005) Certified Professional Coder - Payer (CPC-P)","Certified Professional Coder - Payer (CPC-P)","2",17,"American Academy of Professional Coders","Yes","Yes","Yes",{"$f":"VLOOKUP(B18,'DOE Codes Lookups'!$A$3:$D$507,2,FALSE)","v":{"$error":"#N/A"}}]
[18,"ACOPC006","(ACOPC006) Certified Professional Coder (CPC)","Certified Professional Coder (CPC)","2",18,"American Academy of Professional Coders","Yes","Yes","Yes",{"$f":"VLOOKUP(B19,'DOE Codes Lookups'!$A$3:$D$507,2,FALSE)","v":{"$error":"#N/A"}}]
[19,"ACOPC007","(ACOPC007) Certified Professional Biller (CPB)","Certified Professional Biller (CPB)","2",19,"American Academy of Professional Coders","Yes","Yes","Yes",{"$f":"VLOOKUP(B20,'DOE Codes Lookups'!$A$3:$D$507,2,FALSE)","v":{"$error":"#N/A"}}]
{"$rows_left_out":897}
{"sheet":"Certifications","index":6,"n_rows":539,"n_cols":4,"rows_kept":539,"cut":false,"hidden":false,"merged":[]}
["DOE Code","Certification Title","Certification Agency","Agency Website"]
["AAMIN001","Certified Biomedical Equipment Technician","Association for the Advancement of Medical Instrumentation (AAMI)","www.aami.org/certification/"]
["AAVSB001","Veterinary Technician","American Association of Veterinary State Boards","www.aavsb.org/"]
["ABAYC001","Composite Boat Builder Certification","American Boat & Yacht Council","www.abycinc.org/"]
["ABAYC002","Marine Diesel Certification","American Boat & Yacht Council","www.abycinc.org/"]
["ABAYC003","Marine Electrical Certification","American Boat & Yacht Council","www.abycinc.org/"]
["ABAYC005","Marine Systems Certification","American Boat & Yacht Council","www.abycinc.org/"]
["ABAYC006","A/C Refrigeration Certification","American Boat & Yacht Council","www.abycinc.org/"]
["ABAYC007","Marine Corrosion Certification","American Boat & Yacht Council","www.abycinc.org/"]
["ABCOP001","Certified Prosthetic (and/or) Orthotic Technician (CTPO)","American Board for Certification in Orthotics, Prosthetics & Pedorthics","www.abcop.org"]
["ABRET001","Registered EEG Technologist (R. EEG T.)","American Board of Registration of Electroencephalographic and Evoked Potential Technologists","www.abret.org/"]
["ACFAT001","Accredited Business Accountant (ABA)","Accreditation Council for Accountancy & Taxation","www.acatcredentials.org"]
["ACFED001","Certified Chef de Cuisine","American Culinary Federation","www.acfchefs.org"]
["ACFED002","Certified Culinarian (CC)","American Culinary Federation","www.acfchefs.org"]
["ACFED006","Certified Fundamentals Cook","American Culinary Federation","www.acfchefs.org"]
["ACOPC001","Certified Professional Coder (CPC - Apprentice)","American Academy of Professional Coders","www.aapc.com/"]
["ACOPC004","Certified Outpatient Coder (COC)","American Academy of Professional Coders","www.aapc.com/"]
["ACOPC005","Certified Professional Coder - Payer (CPC-P)","American Academy of Professional Coders","www.aapc.com/"]
["ACOPC006","Certified Professional Coder (CPC)","American Academy of Professional Coders","www.aapc.com/"]
["ACOPC007","Certified Professional Biller (CPB)","American Academy of Professional Coders","www.aapc.com/"]
{"$rows_left_out":520}
{"sheet":"SOC Lookups","index":7,"n_rows":848,"n_cols":3,"rows_kept":848,"cut":false,"hidden":true,"merged":[]}
[null,"2010 SOC codes","Detailed Occupation Title"]
["_"]
[{"$f":"CONCATENATE(\"(\",B3,\") \",C3)","v":"(11-1011) Chief Executives"},"11-1011","Chief Executives"]
[{"$f":"CONCATENATE(\"(\",B4,\") \",C4)","v":"(11-1021) General and Operations Managers"},"11-1021","General and Operations Managers"]
["(11-1031) Legislators","11-1031","Legislators"]
["(11-2011) Advertising and Promotions Managers","11-2011","Advertising and Promotions Managers"]
["(11-2021) Marketing Managers","11-2021","Marketing Managers"]
["(11-2022) Sales Managers","11-2022","Sales Managers"]
["(11-2031) Public Relations and Fundraising Managers","11-2031","Public Relations and Fundraising Managers"]
["(11-3011) Administrative Services Managers","11-3011","Administrative Services Managers"]
["(11-3011 ) Administrative Services Managers","11-3011 ","Administrative Services Managers"]
["(11-3021) Computer and Information Systems Managers","11-3021","Computer and Information Systems Managers"]
["(11-3031) Financial Managers","11-3031","Financial Managers"]
["(11-3051) Industrial Production Managers","11-3051","Industrial Production Managers"]
["(11-3061) Purchasing Managers","11-3061","Purchasing Managers"]
["(11-3071) Transportation, Storage, and Distribution Managers","11-3071","Transportation, Storage, and Distribution Managers"]
["(11-3111) Compensation and Benefits Managers","11-3111","Compensation and Benefits Managers"]
["(11-3121) Human Resources Managers","11-3121","Human Resources Managers"]
["(11-3131) Training and Development Managers","11-3131","Training and Development Managers"]
["(11-9013) Farmers, Ranchers, and Other Agricultural Managers","11-9013","Farmers, Ranchers, and Other Agricultural Managers"]
{"$rows_left_out":829}
{"sheet":"SOC Codes","index":8,"n_rows":861,"n_cols":2,"rows_kept":861,"cut":false,"hidden":false,"merged":[]}
["2010 SOC codes","Detailed Occupation Title"]
["11-1011","Chief Executives"]
["11-1021","General and Operations Managers"]
["11-1031","Legislators"]
["11-2011","Advertising and Promotions Managers"]
["11-2021","Marketing Managers"]
["11-2022","Sales Managers"]
["11-2031","Public Relations and Fundraising Managers"]
["11-3011","Administrative Services Managers"]
["11-3021","Computer and Information Systems Managers"]
["11-3031","Financial Managers"]
["11-3111","Compensation and Benefits Managers"]
["11-3131","Training and Development Managers"]
["11-3121","Human Resources Managers"]
["11-3051","Industrial Production Managers"]
["11-3061","Purchasing Managers"]
["11-3071","Transportation, Storage, and Distribution Managers"]
["11-9013","Farmers, Ranchers, and Other Agricultural Managers**"]
["11-9013","Farmers, Ranchers, and Other Agricultural Managers**"]
["11-9021","Construction Managers"]
{"$rows_left_out":841}