{"text_format":"1","workbook":"xlsx","n_sheets":9,"sheets":["PSICFL Rec","Request_Info","Lookups","DOE Codes Lookups","1920 PSICFL","Codes Master","Certifications","SOC Lookups","SOC Codes"],"not_rendered":{"charts":0,"images":0,"macros":1,"external_links":0,"defined_names":45,"comments":0,"pivot_tables":0},"unopened":[],"bounds":{"document_bytes":16777216,"sheet_cells":100000,"rows_first":2000,"rows_last":500,"rows_between":2000,"halvings":0,"cell_chars":16384,"cell_head_chars":4096},"cells_cut":0,"cells_raw":0,"read":"whole","date_system":"1900"}

{"sheet":"PSICFL Rec","index":0,"n_rows":48,"n_cols":19,"rows_kept":48,"cut":false,"hidden":false,"merged":[[30,0,33,0],[40,1,40,12],[29,4,29,12],[41,1,41,12],[39,11,39,12],[37,1,37,3],[37,4,37,12],[36,4,36,12],[34,1,34,12],[35,1,35,3],[36,1,36,3],[38,1,38,12],[33,1,33,3],[0,0,0,12],[1,0,1,12],[13,1,13,2],[17,1,17,12],[22,1,22,12],[19,1,19,3],[10,0,16,0],[17,0,25,0],[10,1,10,12],[12,1,12,2],[3,0,3,12],[4,0,4,12],[5,0,6,12],[7,0,7,12],[8,0,8,12],[20,4,20,12],[20,1,20,3],[18,4,18,12],[19,4,19,12],[16,1,16,2],[9,0,9,12],[12,3,12,12],[11,1,11,2],[18,1,18,3],[15,1,15,2],[11,3,11,12],[13,3,13,12],[15,3,15,12],[14,3,14,12],[14,1,14,2],[16,3,16,12],[21,4,21,9],[45,1,45,12],[26,0,29,0],[39,1,39,10],[23,1,23,3],[23,4,23,12],[24,1,24,3],[24,4,24,12],[25,4,25,12],[32,4,32,12],[43,1,43,12],[42,1,42,12],[35,4,35,12],[44,1,44,12],[32,1,32,3],[34,0,37,0],[47,0,47,12],[33,4,33,12],[21,1,21,3],[25,1,25,3],[21,10,21,11],[26,1,26,12],[30,1,30,12],[31,1,31,3],[31,4,31,12],[27,1,27,3],[27,4,27,12],[29,1,29,3],[46,0,46,12],[28,1,28,3],[28,4,28,12],[38,0,45,0]]}
["Recommendation Form"]
["2020-21 CAPE Postsecondary Industry Certification Funding List \nFlorida Department of Education"]
[]
["This form is to be used to recommend an industry certification for inclusion on the CAPE Postsecondary Industry Certification Funding List, which will be reviewed by the State Board of Education. "]
["Directions:"]
["1. Save this form using the following naming convention: PSICFL_Agency Name_Certification Name.xls \n2. Complete the form. (Incomplete forms will not be reviewed.) \n3. Use a separate form for each recommendation. \n4. Submit additional supplemental materials as needed in an electronic format with the recommendation form. \n5. Email your recommendations as an Excel attachment to industrycertification@fldoe.org."]
[]
["All forms must be submitted by May 29, 2020 for consideration."]
["For technical questions, please contact Kathryn Wheeler at 850-245-9030. "]
[]
["Step 1","Submitter Information\nPlease tell us about yourself."]
[null,"Type of Submitter",null,"_",null,null,null,null,null,null,null,null,null,null,{"$f":"IF(OR(O19>1,E24<>\"\"),1,0)","v":0},"Check of cert listed",null,{"$f":"IF(D12=\"_\",0,1)","v":0},{"$f":"COUNTIF(R12:R17,0)","v":5}]
[null,"Name",null,null,null,null,null,null,null,null,null,null,null,null,null,null,null,{"$f":"IF(D13=\"\",0,1)","v":0}]
[null,"Title",null,null,null,null,null,null,null,null,null,null,null,null,{"$f":"IF(AND(O12>0,S12>0),\"Step 1\",\"\")","v":""},"Step 1 check",null,{"$f":"IF(D14=\"\",0,1)","v":0}]
[null,"Agency/Institution",null,null,null,null,null,null,null,null,null,null,null,{"$f":"VLOOKUP(D15,Agency_LKP,2,FALSE)","v":{"$error":"#N/A"}},null,null,null,{"$f":"IF(N15<2,0,1)","v":{"$error":"#N/A"}}]
[null,"Phone Number",null,null,null,null,null,null,null,null,null,null,null,null,null,null,null,{"$f":"IF(D16=\"\",0,1)","v":0}]
[null,"E-mail Address",null,null,null,null,null,null,null,null,null,null,null,null,null,null,null,{"$f":"IF(D17=\"\",0,1)","v":0}]
["Step 2","Recommendation for Certifications with a DOE Code \nPlease use the drop-down menu below to determine if the certification/license already exists in the Department's Industry Certification database. A complete list can also be found on the Certifications tab below."]
[null,"Certification Code/Title",null,null,"_",null,null,null,null,null,null,null,null,{"$f":"VLOOKUP(E19,Cert_Lookup,4,FALSE)","v":1},{"$f":"VLOOKUP(E19,Cert_Lookup,4,FALSE)","v":1}]
[null,"Certifying Agency",null,null,{"$f":"VLOOKUP(O19,Cert_Agency,2,FALSE)","v":"_"},null,null,null,null,null,null,null,null,null,null,"Step 2 Check"]
[null,"Agency Website",null,null,{"$f":"VLOOKUP(O19,Cert_Agency,3,FALSE)","v":"_"}]
[null,"Status",null,null,{"$f":"VLOOKUP(N22,Status,2,FALSE)","v":"_"},null,null,null,null,null,"Funding Eligible Request",null,"_",{"$f":"VLOOKUP(E19,Cert_Lookup,3,FALSE)","v":"_"},null,null,null,{"$f":"IF(AND(N22>2,M22=\"_\"),0,1)","v":0}]
[null,"Recommendation for Certifications without a DOE Code \nPlease enter certification/licensure information if not found in the drop-down menu above.",null,null,null,null,null,null,null,null,null,null,null,null,{"$f":"IF(AND(O12>0,S25>0),\"Step 2\",\"\")","v":""}]
[null,"Certification Title",null,null,null,null,null,null,null,null,null,null,null,null,{"$f":"IF(S25>0,\"Step 2\",\"\")","v":"Step 2"},"Step 2 Check"]
[null,"Certifying Agency",null,null,null,null,null,null,null,null,null,null,null,null,null,null,null,{"$f":"IF(AND(E24<>\"\",E25=\"\"),0,1)","v":1},{"$f":"COUNTIF(R22:R26,0)","v":1}]
[null,"Agency Website",null,null,null,null,null,null,null,null,null,null,null,null,null,null,null,{"$f":"IF(AND(E24<>\"\",E26=\"\"),0,1)","v":1}]
["Step 3","Targeted Occupation Area\nWhat occupational area included in the 2019 General Appropriations Act is this certification tied to?",null,null,null,null,null,null,null,null,null,null,null,null,{"$f":"IF(OR(O28=\"Step 3\",O29=\"Step 3\",O30=\"Step 3\"),\"Step 3\",\"\")","v":""}]
[null,"Area Targeted for Funding (Florida College System)",null,null,"_",null,null,null,null,null,null,null,null,{"$f":"IF($D$12=\"District Postsecondary Institution\",1,0)","v":0},{"$f":"IF(AND(O$12>0,E28=\"_\",D12=\"Florida College System Institution\"),\"Step 3\",\"\")","v":""},"Step 3 Check"]
[null,"Area Targeted for Funding (District Postsecondary)",null,null,"_",null,null,null,null,null,null,null,null,{"$f":"IF($D$12=\"Florida College System Institution\",1,0)","v":0},{"$f":"IF(AND(O$12>0,E29=\"_\",D12=\"District Postsecondary Institution\"),\"Step 3\",\"\")","v":""}]
[null,"Provide justification statement for how the certification is linked to the requested targeted occupational area.",null,null,null,null,null,null,null,null,null,null,null,{"$f":"IF(E30=\"\",1,0)","v":1},{"$f":"IF(AND(O$12>0,E30=\"\"),\"Step 3\",\"\")","v":""}]
["Step 4","Standard Occupational Classification (SOC) Code Linkage\nPlease select up to three occupations for which the certification prepares candidates. For a complete list of all SOC codes included, please see the SOC Codes tab."]
[null,"SOC Code 1 (Required)",null,null,"_",null,null,null,null,null,null,null,null,1,{"$f":"IF(AND(O12>0,R32>0),\"Step 4\",\"\")","v":""},"Step 4 Check",null,{"$f":"IF(E32=\"_\",1,0)","v":1}]
[null,"SOC Code 2 (Optional)",null,null,"_"]
[null,"SOC Code 3 (Optional)",null,null,"_"]
["Step 5","Program Linkage\nPlease provide up to three specific programs in which the recommended certification is offered. \nInclude program title, program number, and CIP Number."]
[null,"Program 1 (Title/Number/CIP)",null,null,null,null,null,null,null,null,null,null,null,null,{"$f":"IF(AND(O12>0,R36>0),\"Step 5\",\"\")","v":""},"Step 5 Check",null,{"$f":"IF(E36=\"\",1,0)","v":1}]
[null,"Program 2 (Title/Number/CIP)"]
[null,"Program 3 (Title/Number/CIP)"]
["Step 6","Test Information\nThe recommendation must include the following information on the test(s) associated with the certification. \nWritten examinations must be third-party and proctored.",null,null,null,null,null,null,null,null,null,null,null,null,{"$f":"IF(OR(O40=\"Step 6\",O42=\"Step 6\",O44=\"Step 6\",O46=\"Step 6\"),\"Step 6\",\"\")","v":""},"Step 6 Check"]
[null,"Is the written examination developed by a third party, given solely in a proctored environment and scored by the certifying agency?\n",null,null,null,null,null,null,null,null,null,"_",null,null,{"$f":"IF(AND(O$12>0,L40=\"_\"),\"Step 6\",\"\")","v":""}]
[null,"What are the written examination requirements to earn the certification? "]
[null,null,null,null,null,null,null,null,null,null,null,null,null,null,{"$f":"IF(AND(O$12>0,B42=\"\"),\"Step 6\",\"\")","v":""}]
[null,"What other requirements are needed to earn the certification (e.g., age requirement, program completion)? "]
[null,null,null,null,null,null,null,null,null,null,null,null,null,null,{"$f":"IF(AND(O$12>0,B44=\"\"),\"Step 6\",\"\")","v":""}]
[null,"Please describe any required work experience."]
[null,null,null,null,null,null,null,null,null,null,null,null,null,null,{"$f":"IF(AND(O$12>0,B46=\"\"),\"Step 6\",\"\")","v":""}]
["Form Check\nIncomplete forms will not be reviewed. The following steps may be missing information. Please double-check those steps, and if needed, provide additional information where requested."]
[{"$f":"CONCATENATE(O14,\"   \",O23,\"   \",O27,\"   \",O32,\"   \",O36,\"   \",O39)","v":"               "}]

{"sheet":"Request_Info","index":1,"n_rows":4,"n_cols":27,"rows_kept":4,"cut":false,"hidden":true,"merged":[]}
[null,"Type of Submitter","Name","Title","Agency","Phone Number","Email","Cert Code","Cert Title","Cert Agency","Agency Website","Add funding eligiblity","SOC1","SOC2","SOC3","Area College","Area District","Evidence_TOL","Prog1","Prog2","Prog3","3rd Party","Exam Req","Other Req","Work Exp","Date Received","Review window"]
[null,{"$f":"'PSICFL Rec'!D12","v":"_"},{"$f":"'PSICFL Rec'!D13","v":0},{"$f":"'PSICFL Rec'!D14","v":0},{"$f":"'PSICFL Rec'!D15","v":0},{"$f":"'PSICFL Rec'!D16","v":0},{"$f":"'PSICFL Rec'!D17","v":0},{"$f":"IF('PSICFL Rec'!O19>1,VLOOKUP('PSICFL Rec'!O19,Certs,2,FALSE),\"\")","v":""},{"$f":"IF('PSICFL Rec'!O19>1,VLOOKUP('PSICFL Rec'!O19,Certs,4,FALSE),'PSICFL Rec'!E24)","v":0},{"$f":"IF('PSICFL Rec'!O19>1,VLOOKUP('PSICFL Rec'!O19,Certs,7,FALSE),'PSICFL Rec'!E25)","v":0},{"$f":"IF('PSICFL Rec'!O19>1,VLOOKUP('PSICFL Rec'!O19,Certs,8,FALSE),'PSICFL Rec'!E26)","v":0},{"$f":"'PSICFL Rec'!N22","v":"_"},{"$f":"'PSICFL Rec'!E32","v":"_"},{"$f":"'PSICFL Rec'!E33","v":"_"},{"$f":"'PSICFL Rec'!E34","v":"_"},{"$f":"'PSICFL Rec'!E28","v":"_"},{"$f":"'PSICFL Rec'!E29","v":"_"},{"$f":"'PSICFL Rec'!E30","v":0},{"$f":"'PSICFL Rec'!E36","v":0},{"$f":"'PSICFL Rec'!E37","v":0},{"$f":"'PSICFL Rec'!E38","v":0},{"$f":"'PSICFL Rec'!L40","v":"_"},{"$f":"'PSICFL Rec'!B42","v":0},{"$f":"'PSICFL Rec'!B44","v":0},{"$f":"'PSICFL Rec'!B46","v":0},{"$f":"TODAY()","v":"2020-04-06"},"2020-21"]
[]
[null,{"$f":"IF(B2=\"_\",\"\",B2)","v":""},{"$f":"C2","v":0},0,0,0,0,"",0,0,0,"_",{"$f":"VLOOKUP(M2,SOCReturn,2,FALSE)","v":0},{"$f":"VLOOKUP(N2,SOCReturn,2,FALSE)","v":0},{"$f":"VLOOKUP(O2,SOCReturn,2,FALSE)","v":0},{"$f":"IF(P2=\"_\",\"\",P2)","v":""},{"$f":"IF(Q2=\"_\",\"\",Q2)","v":""},{"$f":"R2","v":0},0,0,0,"_",0,0,0,"2020-04-06","2020-21"]

{"sheet":"Lookups","index":2,"n_rows":99,"n_cols":6,"rows_kept":99,"cut":false,"hidden":true,"merged":[]}
[]
[null,"Agency Name"]
[1,"Select an agency name",1,null,"_"]
[2,"Alachua",2,null,"Yes"]
[3,"Baker",3,null,"No"]
[4,"Bay",4]
[5,"Bradford",5]
[6,"Brevard",6,null,"_"]
[7,"Broward",7,null,"Florida College System Institution"]
[8,"Broward College",8,null,"District Postsecondary Institution"]
[9,"Calhoun",9]
[10,"Charlotte",10]
[11,"Chipola College",11]
[12,"Citrus",12]
[13,"Clay",13]
[14,"College of Central Florida",14]
[15,"Collier",15]
[16,"Columbia",16]
[17,"Daytona State College",17,null,"_"]
[18,"DeSoto",18,null,"Advanced manufacturing"]
[19,"Dixie",19,null,"Auto collision repair and refinishing"]
[20,"Duval",20,null,"Automotive service technology"]
[21,"Eastern Florida State College",21,null,"Cloud virtualization"]
[22,"Escambia",22,null,"Computer programming"]
[23,"Fl School Deaf and Blind",23,null,"Computer-aided drafting"]
[24,"Flagler",24,null,"Cyber security"]
[25,"Florida Gateway College",25,null,"Electrician"]
[26,"Florida Keys Community College",26,null,"Federal Aviation Administration airframe mechanics"]
[27,"Florida SouthWestern State College",27,null,"Federal Aviation Administration power plant mechanics"]
[28,"Florida State College at Jacksonville",28,null,"Health Sciences - Certified nursing assistant"]
[29,"Franklin",29,null,"Health Sciences - Clinical hemodialysis technician"]
[30,"Gadsden",30,null,"Health Sciences - Clinical lab technician"]
[31,"Gilchrist",31,null,"Health Sciences - Dental assisting technology"]
[32,"Glades",32,null,"Health Sciences - EKG technician"]
[33,"Gulf",33,null,"Health Sciences - Emergency medical technician and paramedic"]
[34,"Gulf Coast State College",34,null,"Health Sciences - Medical assisting"]
[35,"Hamilton",35,null,"Health Sciences - Medical coder/biller"]
[36,"Hardee",36,null,"Health Sciences - Orthopedic technology"]
[37,"Hendry",37,null,"Health Sciences - Pharmacy technician"]
[38,"Hernando",38,null,"Health Sciences - Practical nursing"]
[39,"Highlands",39,null,"Health Sciences - Surgical technology"]
[40,"Hillsborough",40,null,"Heating, ventilation and air conditioning technicians"]
[41,"Hillsborough Community College",41,null,"Medium/heavy duty truck technician"]
[42,"Holmes",42,null,"Network support services"]
[43,"Indian River",43,null,"Plumbing"]
[44,"Indian River State College",44,null,"Public Safety"]
[45,"Jackson",45,null,"Welding"]
[46,"Jefferson",46]
[47,"Lafayette",47,null,"_"]
[48,"Lake",48,null,"Advanced manufacturing"]
[49,"Lake-Sumter State College",49,null,"Auto collision repair and refinishing"]
[50,"Lee",50,null,"Automotive service technology"]
[51,"Leon",51,null,"Cloud virtualization"]
[52,"Levy",52,null,"Computer programming"]
[53,"Liberty",53,null,"Cyber security"]
[54,"Madison",54,null,"Electrician"]
[55,"Manatee",55,null,"Federal Aviation Administration airframe mechanics"]
[56,"Marion",56,null,"Federal Aviation Administration power plant mechanics"]
[57,"Martin",57,null,"Health Sciences"]
[58,"Miami Dade College",58,null,"Heating, ventilation and air conditioning technicians"]
[59,"Miami-Dade",59,null,"Network support services"]
[60,"Monroe",60,null,"Pharmacy Technicians"]
[61,"Nassau",61,null,"Public safety"]
[62,"North Florida Community College",62,null,"Unmanned aircraft systems"]
[63,"Northwest Florida State College",63,null,"Welding"]
[64,"Okaloosa",64]
[65,"Okeechobee",65]
[66,"Orange",66]
[67,"Osceola",67]
[68,"Palm Beach",68]
[69,"Palm Beach State College",69]
[70,"Pasco",70,null,"Status"]
[71,"Pasco-Hernando State College",71,null,"_","_"]
[72,"Pensacola State College",72,null,1,"Certification is not on the PSICFL and may be recommended for addition. Please complete Steps 3-6 below. "]
[73,"Pinellas",73,null,2,"Certification is on the PSICFL and is already funding eligible. There is no need to resubmit this request. "]
[74,"Polk",74]
[75,"Polk State College",75,null,4,"Certification is on the PSICFL and is already funding eligible for Florida Colleges. If you are a district and would like to request it to become funding eligible, in the box on the right please select \"Yes\" and complete Steps 3-6 below."]
[76,"Putnam",76,null,5,"Certification is on the PSICFL and is already funding eligible for Districts. If you are a Florida College and would like to request it to become funding eligible, in the box on the right please select \"Yes\" and complete Steps 3-6 below."]
[77,"Saint Johns",77]
[78,"Saint Johns River State College",78]
[79,"Saint Lucie",79]
[80,"Saint Petersburg College",80]
[81,"Santa Fe College",81]
[82,"Santa Rosa",82]
[83,"Sarasota",83]
[84,"Seminole",84]
[85,"Seminole State College of Florida",85]
[86,"South Florida State College",86]
[87,"State College of Florida, Manatee-Sarasota",87]
[88,"Sumter",88]
[89,"Suwannee",89]
[90,"Tallahassee Community College",90]
[91,"Taylor",91]
[92,"Union",92]
[93,"Valencia College",93]
[94,"Volusia",94]
[95,"Wakulla",95]
[96,"Walton",96]
[97,"Washington",97]

{"sheet":"DOE Codes Lookups","index":3,"n_rows":836,"n_cols":8,"rows_kept":836,"cut":false,"hidden":true,"merged":[]}
[null,"DOE Code",null,"Certification Title","Status",null,"Certification Agency","Agency Website"]
[1,null,"_","_","_",1,"_","_"]
[2,"AAMIN001","(AAMIN001) Certified Biomedical Equipment Technician","Certified Biomedical Equipment Technician",4,2,"Association for the Advancement of Medical Instrumentation (AAMI)",{"$f":"VLOOKUP(B3,Certifications!$A$2:$D$844,4,FALSE)","v":"www.aami.org/certification/"}]
[3,"AAVSB001","(AAVSB001) Veterinary Technician","Veterinary Technician",1,3,"American Association of Veterinary State Boards",{"$f":"VLOOKUP(B4,Certifications!$A$2:$D$844,4,FALSE)","v":"www.aavsb.org/"}]
[4,"ABAYC001","(ABAYC001) Composite Boat Builder Certification","Composite Boat Builder Certification",2,4,"American Boat & Yacht Council",{"$f":"VLOOKUP(B5,Certifications!$A$2:$D$844,4,FALSE)","v":"www.abycinc.org/"}]
[5,"ABAYC002","(ABAYC002) Marine Diesel Certification","Marine Diesel Certification",1,5,"American Boat & Yacht Council",{"$f":"VLOOKUP(B6,Certifications!$A$2:$D$844,4,FALSE)","v":"www.abycinc.org/"}]
[6,"ABAYC003","(ABAYC003) Marine Electrical Certification","Marine Electrical Certification",2,6,"American Boat & Yacht Council",{"$f":"VLOOKUP(B7,Certifications!$A$2:$D$844,4,FALSE)","v":"www.abycinc.org/"}]
[7,"ABAYC005","(ABAYC005) Marine Systems Certification","Marine Systems Certification",1,7,"American Boat & Yacht Council",{"$f":"VLOOKUP(B8,Certifications!$A$2:$D$844,4,FALSE)","v":"www.abycinc.org/"}]
[8,"ABAYC006","(ABAYC006) A/C Refrigeration Certification","A/C Refrigeration Certification",2,8,"American Boat & Yacht Council",{"$f":"VLOOKUP(B9,Certifications!$A$2:$D$844,4,FALSE)","v":"www.abycinc.org/"}]
[9,"ABAYC007","(ABAYC007) Marine Corrosion Certification","Marine Corrosion Certification",1,9,"American Boat & Yacht Council",{"$f":"VLOOKUP(B10,Certifications!$A$2:$D$844,4,FALSE)","v":"www.abycinc.org/"}]
[10,"ABCOP001","(ABCOP001) Certified Prosthetic (and/or) Orthotic Technician (CTPO)","Certified Prosthetic (and/or) Orthotic Technician (CTPO)",4,10,"American Board for Certification in Orthotics, Prosthetics & Pedorthics",{"$f":"VLOOKUP(B11,Certifications!$A$2:$D$844,4,FALSE)","v":"www.abcop.org"}]
[11,"ABRET001","(ABRET001) Registered EEG Technologist (R. EEG T.)","Registered EEG Technologist (R. EEG T.)",1,11,"American Board of Registration of Electroencephalographic and Evoked Potential Technologists",{"$f":"VLOOKUP(B12,Certifications!$A$2:$D$844,4,FALSE)","v":"www.abret.org/"}]
[12,"ACFAT001","(ACFAT001) Accredited Business Accountant (ABA)","Accredited Business Accountant (ABA)",1,12,"Accreditation Council for Accountancy & Taxation",{"$f":"VLOOKUP(B13,Certifications!$A$2:$D$844,4,FALSE)","v":"www.acatcredentials.org"}]
[13,"ACFED001","(ACFED001) Certified Chef de Cuisine","Certified Chef de Cuisine",1,13,"American Culinary Federation",{"$f":"VLOOKUP(B14,Certifications!$A$2:$D$844,4,FALSE)","v":"www.acfchefs.org"}]
[14,"ACFED002","(ACFED002) Certified Culinarian (CC)","Certified Culinarian (CC)",1,14,"American Culinary Federation",{"$f":"VLOOKUP(B15,Certifications!$A$2:$D$844,4,FALSE)","v":"www.acfchefs.org"}]
[15,"ACFED006","(ACFED006) Certified Fundamentals Cook","Certified Fundamentals Cook",1,15,"American Culinary Federation",{"$f":"VLOOKUP(B16,Certifications!$A$2:$D$844,4,FALSE)","v":"www.acfchefs.org"}]
[16,"ACOPC001","(ACOPC001) Certified Professional Coder (CPC - Apprentice)","Certified Professional Coder (CPC - Apprentice)",1,16,"American Academy of Professional Coders",{"$f":"VLOOKUP(B17,Certifications!$A$2:$D$844,4,FALSE)","v":"www.aapc.com/"}]
[17,"ACOPC004","(ACOPC004) Certified Outpatient Coder (COC)","Certified Outpatient Coder (COC)",2,17,"American Academy of Professional Coders",{"$f":"VLOOKUP(B18,Certifications!$A$2:$D$844,4,FALSE)","v":"www.aapc.com/"}]
[18,"ACOPC005","(ACOPC005) Certified Professional Coder - Payer (CPC-P)","Certified Professional Coder - Payer (CPC-P)",2,18,"American Academy of Professional Coders",{"$f":"VLOOKUP(B19,Certifications!$A$2:$D$844,4,FALSE)","v":"www.aapc.com/"}]
[19,"ACOPC006","(ACOPC006) Certified Professional Coder (CPC)","Certified Professional Coder (CPC)",2,19,"American Academy of Professional Coders",{"$f":"VLOOKUP(B20,Certifications!$A$2:$D$844,4,FALSE)","v":"www.aapc.com/"}]
[20,"ACOPC007","(ACOPC007) Certified Professional Biller (CPB)","Certified Professional Biller (CPB)",2,20,"American Academy of Professional Coders",{"$f":"VLOOKUP(B21,Certifications!$A$2:$D$844,4,FALSE)","v":"www.aapc.com/"}]
[21,"ACOSM001","(ACOSM001) Certified Survey Technician (CST)","Certified Survey Technician (CST)",1,21,"American Congress on Surveying and Mapping - National Society of Professional Surveyors",{"$f":"VLOOKUP(B22,Certifications!$A$2:$D$844,4,FALSE)","v":"www.acsm.net"}]
[22,"ACSMD002","(ACSMD002) Certified Personal Trainer","Certified Personal Trainer",4,22,"American College of Sports Medicine",{"$f":"VLOOKUP(B23,Certifications!$A$2:$D$844,4,FALSE)","v":"www.acsm.org"}]
[23,"ADESK002","(ADESK002) Autodesk Certified User - AutoCAD","Autodesk Certified User - AutoCAD",1,23,"Autodesk",{"$f":"VLOOKUP(B24,Certifications!$A$2:$D$844,4,FALSE)","v":"www.autodesk.com"}]
[24,"ADESK008","(ADESK008) Autodesk Certified User - Revit Architecture","Autodesk Certified User - Revit Architecture",1,24,"Autodesk",{"$f":"VLOOKUP(B25,Certifications!$A$2:$D$844,4,FALSE)","v":"www.autodesk.com"}]
[25,"ADESK011","(ADESK011) Autodesk Certified User - Inventor","Autodesk Certified User - Inventor",1,25,"Autodesk",{"$f":"VLOOKUP(B26,Certifications!$A$2:$D$844,4,FALSE)","v":"www.autodesk.com"}]
[26,"ADESK021","(ADESK021) Autodesk Certified Professional - AutoCAD","Autodesk Certified Professional - AutoCAD",5,26,"Autodesk",{"$f":"VLOOKUP(B27,Certifications!$A$2:$D$844,4,FALSE)","v":"www.autodesk.com"}]
[27,"ADESK023","(ADESK023) Autodesk Certified Professional - AutoCAD Civil 3D","Autodesk Certified Professional - AutoCAD Civil 3D",5,27,"Autodesk",{"$f":"VLOOKUP(B28,Certifications!$A$2:$D$844,4,FALSE)","v":"www.autodesk.com"}]
[28,"ADESK024","(ADESK024) Autodesk Certified Professional - Inventor","Autodesk Certified Professional - Inventor",5,28,"Autodesk",{"$f":"VLOOKUP(B29,Certifications!$A$2:$D$844,4,FALSE)","v":"www.autodesk.com"}]
[29,"ADESK025","(ADESK025) Autodesk Certified Professional - Revit Architecture","Autodesk Certified Professional - Revit Architecture",5,29,"Autodesk",{"$f":"VLOOKUP(B30,Certifications!$A$2:$D$844,4,FALSE)","v":"www.autodesk.com"}]
[30,"ADESK030","(ADESK030) Autodesk Certified User - Maya","Autodesk Certified User - Maya",1,30,"Autodesk",{"$f":"VLOOKUP(B31,Certifications!$A$2:$D$844,4,FALSE)","v":"www.autodesk.com"}]
[31,"ADESK032","(ADESK032) Autodesk Certified User - Fusion 360","Autodesk Certified User - Fusion 360",1,31,"Autodesk",{"$f":"VLOOKUP(B32,Certifications!$A$2:$D$844,4,FALSE)","v":"www.autodesk.com"}]
[32,"ADOBE002","(ADOBE002) Adobe Certified Expert (ACE) - After Effects","Adobe Certified Expert (ACE) - After Effects",1,32,"Adobe Systems",{"$f":"VLOOKUP(B33,Certifications!$A$2:$D$844,4,FALSE)","v":"www.adobe.com"}]
[33,"ADOBE003","(ADOBE003) Adobe Certified Expert (ACE) - Illustrator","Adobe Certified Expert (ACE) - Illustrator",1,33,"Adobe Systems",{"$f":"VLOOKUP(B34,Certifications!$A$2:$D$844,4,FALSE)","v":"www.adobe.com"}]
[34,"ADOBE004","(ADOBE004) Adobe Certified Expert (ACE) - InDesign","Adobe Certified Expert (ACE) - InDesign",1,34,"Adobe Systems",{"$f":"VLOOKUP(B35,Certifications!$A$2:$D$844,4,FALSE)","v":"www.adobe.com"}]
[35,"ADOBE005","(ADOBE005) Adobe Certified Expert (ACE) - Photoshop","Adobe Certified Expert (ACE) - Photoshop",1,35,"Adobe Systems",{"$f":"VLOOKUP(B36,Certifications!$A$2:$D$844,4,FALSE)","v":"www.adobe.com"}]
[36,"ADOBE007","(ADOBE007) Adobe Certified Expert (ACE) - Premiere Pro","Adobe Certified Expert (ACE) - Premiere Pro",1,36,"Adobe Systems",{"$f":"VLOOKUP(B37,Certifications!$A$2:$D$844,4,FALSE)","v":"www.adobe.com"}]
[37,"ADOBE010","(ADOBE010) Adobe Certified Associate (ACA) - Dreamweaver","Adobe Certified Associate (ACA) - Dreamweaver",1,37,"Adobe Systems",{"$f":"VLOOKUP(B38,Certifications!$A$2:$D$844,4,FALSE)","v":"www.adobe.com"}]
[38,"ADOBE011","(ADOBE011) Adobe Certified Associate (ACA) - Flash/Animate","Adobe Certified Associate (ACA) - Flash/Animate",1,38,"Adobe Systems",{"$f":"VLOOKUP(B39,Certifications!$A$2:$D$844,4,FALSE)","v":"www.adobe.com"}]
[39,"ADOBE013","(ADOBE013) Adobe Certified Expert (ACE) - Acrobat","Adobe Certified Expert (ACE) - Acrobat",1,39,"Adobe Systems",{"$f":"VLOOKUP(B40,Certifications!$A$2:$D$844,4,FALSE)","v":"www.adobe.com"}]
[40,"ADOBE018","(ADOBE018) Adobe Certified Associate (ACA) - Premiere Pro","Adobe Certified Associate (ACA) - Premiere Pro",1,40,"Adobe Systems",{"$f":"VLOOKUP(B41,Certifications!$A$2:$D$844,4,FALSE)","v":"www.adobe.com"}]
[41,"ADOBE019","(ADOBE019) Adobe Certified Expert (ACE) - Dreamweaver","Adobe Certified Expert (ACE) - Dreamweaver",1,41,"Adobe Systems",{"$f":"VLOOKUP(B42,Certifications!$A$2:$D$844,4,FALSE)","v":"www.adobe.com"}]
[42,"ADOBE020","(ADOBE020) Adobe Certified Associate (ACA) - Illustrator","Adobe Certified Associate (ACA) - Illustrator",1,42,"Adobe Systems",{"$f":"VLOOKUP(B43,Certifications!$A$2:$D$844,4,FALSE)","v":"www.adobe.com"}]
[43,"ADOBE021","(ADOBE021) Adobe Certified Associate (ACA) - InDesign","Adobe Certified Associate (ACA) - InDesign",1,43,"Adobe Systems",{"$f":"VLOOKUP(B44,Certifications!$A$2:$D$844,4,FALSE)","v":"www.adobe.com"}]
[44,"ADOBE022","(ADOBE022) Adobe Certified Associate (ACA) - Photoshop (Creative Cloud 2015 or later)","Adobe Certified Associate (ACA) - Photoshop (Creative Cloud 2015 or later)",1,44,"Adobe Systems",{"$f":"VLOOKUP(B45,Certifications!$A$2:$D$844,4,FALSE)","v":"www.adobe.com"}]
[45,"ADOBE023","(ADOBE023) Adobe Certified Associate (ACA) Video Design Specialist \n(Requires two of the following: After Effects, Premiere Pro, Photoshop)","Adobe Certified Associate (ACA) Video Design Specialist \n(Requires two of the following: After Effects, Premiere Pro, Photoshop)",1,45,"Adobe Systems",{"$f":"VLOOKUP(B46,Certifications!$A$2:$D$844,4,FALSE)","v":"www.adobe.com"}]
[46,"ADOBE024","(ADOBE024) Adobe Certified Associate (ACA) Visual Design Specialist\n(Requires two of the following: Illustrator, InDesign, Photoshop)","Adobe Certified Associate (ACA) Visual Design Specialist\n(Requires two of the following: Illustrator, InDesign, Photoshop)",1,46,"Adobe Systems",{"$f":"VLOOKUP(B47,Certifications!$A$2:$D$844,4,FALSE)","v":"www.adobe.com"}]
[47,"ADOBE025","(ADOBE025) Adobe Certified Associate (ACA) Web Design Specialist\n(Requires two of the following: Animate, Dreamweaver and Photoshop)","Adobe Certified Associate (ACA) Web Design Specialist\n(Requires two of the following: Animate, Dreamweaver and Photoshop)",1,47,"Adobe Systems",{"$f":"VLOOKUP(B48,Certifications!$A$2:$D$844,4,FALSE)","v":"www.adobe.com"}]
[48,"AFHDI001","(AFHDI001) Certified Healthcare Documentation Specialist (CHDS)","Certified Healthcare Documentation Specialist (CHDS)",4,48,"Association for Healthcare Documentation Integrity (AHDI)",{"$f":"VLOOKUP(B49,Certifications!$A$2:$D$844,4,FALSE)","v":"www.ahdionline.org"}]
[49,"AFHDI002","(AFHDI002) Registered Healthcare Documentation Specialist (RHDS)","Registered Healthcare Documentation Specialist (RHDS)",4,49,"Association for Healthcare Documentation Integrity (AHDI)",{"$f":"VLOOKUP(B50,Certifications!$A$2:$D$844,4,FALSE)","v":"www.ahdionline.org"}]
[50,"AHCSM001","(AHCSM001) Certified Registered Central Service Technician","Certified Registered Central Service Technician",1,50,"International Association of Healthcare Central Service Material Management",{"$f":"VLOOKUP(B51,Certifications!$A$2:$D$844,4,FALSE)","v":"iahcsmm.org/"}]
[51,"AHIMA001","(AHIMA001) Certified Coding Associate (CCA)","Certified Coding Associate (CCA)",2,51,"American Health Information Management Association",{"$f":"VLOOKUP(B52,Certifications!$A$2:$D$844,4,FALSE)","v":"www.ahima.org"}]
[52,"AHIMA002","(AHIMA002) Certified Coding Specialist (CCS)","Certified Coding Specialist (CCS)",2,52,"American Health Information Management Association",{"$f":"VLOOKUP(B53,Certifications!$A$2:$D$844,4,FALSE)","v":"www.ahima.org"}]
[53,"AHIMA003","(AHIMA003) Certified Coding Specialist - Physician-based (CCS-P)","Certified Coding Specialist - Physician-based (CCS-P)",2,53,"American Health Information Management Association",{"$f":"VLOOKUP(B54,Certifications!$A$2:$D$844,4,FALSE)","v":"www.ahima.org"}]
[54,"AHIMA007","(AHIMA007) Registered Health Information Administrator (RHIA)","Registered Health Information Administrator (RHIA)",4,54,"American Health Information Management Association",{"$f":"VLOOKUP(B55,Certifications!$A$2:$D$844,4,FALSE)","v":"www.ahima.org"}]
[55,"AHIMA009","(AHIMA009) Registered Health Information Technician (RHIT)","Registered Health Information Technician (RHIT)",4,55,"American Health Information Management Association",{"$f":"VLOOKUP(B56,Certifications!$A$2:$D$844,4,FALSE)","v":"www.ahima.org"}]
[56,"AHIMA010","(AHIMA010) Certified in Health Care Privacy & Security (CHPS)","Certified in Health Care Privacy & Security (CHPS)",4,56,"American Health Information Management Association",{"$f":"VLOOKUP(B57,Certifications!$A$2:$D$844,4,FALSE)","v":"www.ahima.org"}]
[57,"AHIMA011","(AHIMA011) Certified Healthcare Technology Specialist - Clinician/Practitioner Consultant (CHTS-CP)","Certified Healthcare Technology Specialist - Clinician/Practitioner Consultant (CHTS-CP)",4,57,"American Health Information Management Association",{"$f":"VLOOKUP(B58,Certifications!$A$2:$D$844,4,FALSE)","v":"www.ahima.org"}]
[58,"AHIMA012","(AHIMA012) Certified Healthcare Technology Specialist - Implementation Manager (CHTS-IM)","Certified Healthcare Technology Specialist - Implementation Manager (CHTS-IM)",4,58,"American Health Information Management Association",{"$f":"VLOOKUP(B59,Certifications!$A$2:$D$844,4,FALSE)","v":"www.ahima.org"}]
[59,"AHIMA013","(AHIMA013) Certified Healthcare Technology Specialist - Implementation Support Specialist (CHTS-IS)","Certified Healthcare Technology Specialist - Implementation Support Specialist (CHTS-IS)",4,59,"American Health Information Management Association",{"$f":"VLOOKUP(B60,Certifications!$A$2:$D$844,4,FALSE)","v":"www.ahima.org"}]
[60,"AHIMA014","(AHIMA014) Certified Healthcare Technology Specialist - Practice Workflow & Information Management Redesign Specialist (CHTS-PW)","Certified Healthcare Technology Specialist - Practice Workflow & Information Management Redesign Specialist (CHTS-PW)",4,60,"American Health Information Management Association",{"$f":"VLOOKUP(B61,Certifications!$A$2:$D$844,4,FALSE)","v":"www.ahima.org"}]
[61,"AHIMA015","(AHIMA015) Certified Healthcare Technology Specialist - Technical/Software Support Staff (CHTS-TS)","Certified Healthcare Technology Specialist - Technical/Software Support Staff (CHTS-TS)",4,61,"American Health Information Management Association",{"$f":"VLOOKUP(B62,Certifications!$A$2:$D$844,4,FALSE)","v":"www.ahima.org"}]
[62,"AHIMA016","(AHIMA016) Certified Healthcare Technology Specialist - Trainer (CHTS-TR)","Certified Healthcare Technology Specialist - Trainer (CHTS-TR)",4,62,"American Health Information Management Association",{"$f":"VLOOKUP(B63,Certifications!$A$2:$D$844,4,FALSE)","v":"www.ahima.org"}]
[63,"AHIMA017","(AHIMA017) Certified Documentation Improvement Practitioner (CDIP)","Certified Documentation Improvement Practitioner (CDIP)",4,63,"American Health Information Management Association",{"$f":"VLOOKUP(B64,Certifications!$A$2:$D$844,4,FALSE)","v":"www.ahima.org"}]
[64,"AHIMA018","(AHIMA018) Certified Health Data Analyst (CHDA)","Certified Health Data Analyst (CHDA)",4,64,"American Health Information Management Association",{"$f":"VLOOKUP(B65,Certifications!$A$2:$D$844,4,FALSE)","v":"www.ahima.org"}]
[65,"AHLAE002","(AHLAE002) Hospitality Industry Knowledge (U.S.) ","Hospitality Industry Knowledge (U.S.) ",1,65,"American Hotel and Lodging Association Educational Institute",{"$f":"VLOOKUP(B66,Certifications!$A$2:$D$844,4,FALSE)","v":"www.ahlei.org"}]
[66,"AHLAE011","(AHLAE011) Certified Hospitality Supervisor (CHS)","Certified Hospitality Supervisor (CHS)",1,66,"American Hotel and Lodging Association Educational Institute",{"$f":"VLOOKUP(B67,Certifications!$A$2:$D$844,4,FALSE)","v":"www.ahlei.org"}]
[67,"AIOPB001","(AIOPB001) Certified Bookkeeper","Certified Bookkeeper",1,67,"American Institute of Professional Bookkeepers",{"$f":"VLOOKUP(B68,Certifications!$A$2:$D$844,4,FALSE)","v":"www.aipb.org"}]
[68,"AMAMA001","(AMAMA001) Certified Medical Assistant (CMA)","Certified Medical Assistant (CMA)",2,68,"American Association of Medical Assistants",{"$f":"VLOOKUP(B69,Certifications!$A$2:$D$844,4,FALSE)","v":"www.aama-ntl.org"}]
[69,"AMAOB001","(AMAOB001) Medical Laboratory Technician (MLT) ","Medical Laboratory Technician (MLT) ",2,69,"American Association of Bioanalysts (AAB)",{"$f":"VLOOKUP(B70,Certifications!$A$2:$D$844,4,FALSE)","v":"www.aab.org"}]
[70,"AMAOB002","(AMAOB002) Medical Technologist (MT(AAB))","Medical Technologist (MT(AAB))",1,70,"American Association of Bioanalysts (AAB)",{"$f":"VLOOKUP(B71,Certifications!$A$2:$D$844,4,FALSE)","v":"www.aab.org"}]
[71,"AMAZN001","(AMAZN001) AWS Certified Solutions Architect - Associate","AWS Certified Solutions Architect - Associate",2,71,"Amazon",{"$f":"VLOOKUP(B72,Certifications!$A$2:$D$844,4,FALSE)","v":"www.amazon.com"}]
[72,"AMAZN002","(AMAZN002) AWS Certified Cloud Practitioner","AWS Certified Cloud Practitioner",2,72,"Amazon",{"$f":"VLOOKUP(B73,Certifications!$A$2:$D$844,4,FALSE)","v":"www.amazon.com"}]
[73,"AMCMA001","(AMCMA001) Certified Composites Technician","Certified Composites Technician",1,73,"American Composites Manufacturers Association",{"$f":"VLOOKUP(B74,Certifications!$A$2:$D$844,4,FALSE)","v":"www.acmanet.org"}]
[74,"AMDDA002","(AMDDA002) Certified Apprentice Drafter - Architectural","Certified Apprentice Drafter - Architectural",1,74,"American Design Drafting Association",{"$f":"VLOOKUP(B75,Certifications!$A$2:$D$844,4,FALSE)","v":"www.adda.org"}]
[75,"AMDDA003","(AMDDA003) Certified Drafter - Architectural","Certified Drafter - Architectural",5,75,"American Design Drafting Association",{"$f":"VLOOKUP(B76,Certifications!$A$2:$D$844,4,FALSE)","v":"www.adda.org"}]
[76,"AMDDA004","(AMDDA004) Certified Drafter - Mechanical","Certified Drafter - Mechanical",5,76,"American Design Drafting Association",{"$f":"VLOOKUP(B77,Certifications!$A$2:$D$844,4,FALSE)","v":"www.adda.org"}]
[77,"AMDDA005","(AMDDA005) Certified Apprentice Drafter - Mechanical","Certified Apprentice Drafter - Mechanical",1,77,"American Design Drafting Association",{"$f":"VLOOKUP(B78,Certifications!$A$2:$D$844,4,FALSE)","v":"www.adda.org"}]
[78,"AMEDT002","(AMEDT002) Medical Laboratory Technician","Medical Laboratory Technician",2,78,"American Medical Technologists (AMT)",{"$f":"VLOOKUP(B79,Certifications!$A$2:$D$844,4,FALSE)","v":"https://www.americanmedtech.org/"}]
[79,"AMEDT004","(AMEDT004) Registered Medical Assistant (RMA)","Registered Medical Assistant (RMA)",2,79,"American Medical Technologists (AMT)",{"$f":"VLOOKUP(B80,Certifications!$A$2:$D$844,4,FALSE)","v":"https://www.americanmedtech.org/"}]
[80,"AMEDT005","(AMEDT005) Registered Phlebotomy Technician (RPT)","Registered Phlebotomy Technician (RPT)",1,80,"American Medical Technologists (AMT)",{"$f":"VLOOKUP(B81,Certifications!$A$2:$D$844,4,FALSE)","v":"https://www.americanmedtech.org/"}]
[81,"AMEDT006","(AMEDT006) Medical Laboratory Assistant (CMLA)","Medical Laboratory Assistant (CMLA)",1,81,"American Medical Technologists (AMT)",{"$f":"VLOOKUP(B82,Certifications!$A$2:$D$844,4,FALSE)","v":"https://www.americanmedtech.org/"}]
[82,"AMOPT001","(AMOPT001) Certified Paraoptometric Assistant (CPOA)","Certified Paraoptometric Assistant (CPOA)",4,82,"American Optometric Association",{"$f":"VLOOKUP(B83,Certifications!$A$2:$D$844,4,FALSE)","v":"www.aoa.org/x4931.xml"}]
[83,"AMRRT002","(AMRRT002) Registered Technologist (Radiography)","Registered Technologist (Radiography)",4,83,"American Registry of Radiologic Technologists",{"$f":"VLOOKUP(B84,Certifications!$A$2:$D$844,4,FALSE)","v":"www.arrt.org"}]
[84,"AMRRT003","(AMRRT003) Radiologic Technologist (Sonography)","Radiologic Technologist (Sonography)",4,84,"American Registry of Radiologic Technologists",{"$f":"VLOOKUP(B85,Certifications!$A$2:$D$844,4,FALSE)","v":"www.arrt.org"}]
[85,"AMRRT005","(AMRRT005) Registered Technologist - Quality Management (R.T.)","Registered Technologist - Quality Management (R.T.)",4,85,"American Registry of Radiologic Technologists",{"$f":"VLOOKUP(B86,Certifications!$A$2:$D$844,4,FALSE)","v":"www.arrt.org"}]
[86,"AMRRT006","(AMRRT006) Registered Technologist (Nuclear Medicine)","Registered Technologist (Nuclear Medicine)",4,86,"American Registry of Radiologic Technologists",{"$f":"VLOOKUP(B87,Certifications!$A$2:$D$844,4,FALSE)","v":"www.arrt.org"}]
[87,"AMRRT007","(AMRRT007) Registered Technologist (Radiation Therapy)","Registered Technologist (Radiation Therapy)",4,87,"American Registry of Radiologic Technologists",{"$f":"VLOOKUP(B88,Certifications!$A$2:$D$844,4,FALSE)","v":"www.arrt.org"}]
[88,"AMRRT008","(AMRRT008) Computed Tomography (CT)","Computed Tomography (CT)",4,88,"American Registry of Radiologic Technologists",{"$f":"VLOOKUP(B89,Certifications!$A$2:$D$844,4,FALSE)","v":"www.arrt.org"}]
[89,"AMSCP001","(AMSCP001) Histotechnologist, HTL(ASCP)","Histotechnologist, HTL(ASCP)",4,89,"American Society of Clinical Pathology",{"$f":"VLOOKUP(B90,Certifications!$A$2:$D$844,4,FALSE)","v":"www.ascp.org"}]
[90,"AMSCP002","(AMSCP002) Medical Laboratory Technician (MLT(ASCP))","Medical Laboratory Technician (MLT(ASCP))",4,90,"American Society of Clinical Pathology",{"$f":"VLOOKUP(B91,Certifications!$A$2:$D$844,4,FALSE)","v":"www.ascp.org"}]
[91,"AMSFQ001","(AMSFQ001) Manager of Quality/Organizational Excellence","Manager of Quality/Organizational Excellence",2,91,"American Society for Quality",{"$f":"VLOOKUP(B92,Certifications!$A$2:$D$844,4,FALSE)","v":"www.asq.org"}]
[92,"AMSFQ006","(AMSFQ006) Quality Improvement Associate (CQIA)","Quality Improvement Associate (CQIA)",2,92,"American Society for Quality",{"$f":"VLOOKUP(B93,Certifications!$A$2:$D$844,4,FALSE)","v":"www.asq.org"}]
[93,"AMSFQ011","(AMSFQ011) Six Sigma Black Belt (CSSBB)","Six Sigma Black Belt (CSSBB)",2,93,"American Society for Quality",{"$f":"VLOOKUP(B94,Certifications!$A$2:$D$844,4,FALSE)","v":"www.asq.org"}]
[94,"AMSFQ012","(AMSFQ012) Six Sigma Green Belt (CSSGB)","Six Sigma Green Belt (CSSGB)",2,94,"American Society for Quality",{"$f":"VLOOKUP(B95,Certifications!$A$2:$D$844,4,FALSE)","v":"www.asq.org"}]
[95,"AMSPT002","(AMSPT002) Certified Phlebotomy Technician","Certified Phlebotomy Technician",1,95,"American Society of Phlebotomy Technicians",{"$f":"VLOOKUP(B96,Certifications!$A$2:$D$844,4,FALSE)","v":"www.aspt.org"}]
[96,"AMSTL004","(AMSTL004) Professional Designation in Supply Chain Management (PLS)","Professional Designation in Supply Chain Management (PLS)",2,96,"American Production and Inventory Control Society (APICS)",{"$f":"VLOOKUP(B97,Certifications!$A$2:$D$844,4,FALSE)","v":"www.astl.org"}]
[97,"APICS001","(APICS001) Certified in Logistics, Transportation, and Distribution (CLTD)","Certified in Logistics, Transportation, and Distribution (CLTD)",2,97,"American Production and Inventory Control Society (APICS)",{"$f":"VLOOKUP(B98,Certifications!$A$2:$D$844,4,FALSE)","v":"www.apics.org"}]
[98,"APPLE002","(APPLE002) Apple Certified Technical Coordinator","Apple Certified Technical Coordinator",1,98,"Apple, Inc.",{"$f":"VLOOKUP(B99,Certifications!$A$2:$D$844,4,FALSE)","v":"training.apple.com"}]
[99,"APPLE019","(APPLE019) Apple Certified Support Professional","Apple Certified Support Professional",1,99,"Apple, Inc.",{"$f":"VLOOKUP(B100,Certifications!$A$2:$D$844,4,FALSE)","v":"training.apple.com"}]
[100,"APPLE020","(APPLE020) Apple Certified Pro (ACP) - Final Cut Pro X","Apple Certified Pro (ACP) - Final Cut Pro X",1,100,"Apple, Inc.",{"$f":"VLOOKUP(B101,Certifications!$A$2:$D$844,4,FALSE)","v":"training.apple.com"}]
[101,"APPLE021","(APPLE021) Apple App Development with Swift Certification Level 1","Apple App Development with Swift Certification Level 1",1,101,"Apple, Inc.",{"$f":"VLOOKUP(B102,Certifications!$A$2:$D$844,4,FALSE)","v":"training.apple.com"}]
[102,"APSCO001","(APSCO001) Emergency Medical Dispatcher","Emergency Medical Dispatcher",1,102,"APCO Institute",{"$f":"VLOOKUP(B103,Certifications!$A$2:$D$844,4,FALSE)","v":"www.apcointl.org/institute/courses/emd.htm"}]
[103,"ARDMS001","(ARDMS001) Registered Diagnostic Cardiac Sonographer (RDCS)","Registered Diagnostic Cardiac Sonographer (RDCS)",4,103,"American Registry for Diagnostic Medical Sonography",{"$f":"VLOOKUP(B104,Certifications!$A$2:$D$844,4,FALSE)","v":"www.ardms.org"}]
[104,"ARDMS002","(ARDMS002) Registered Diagnostic Medical Sonographer (RDMS)","Registered Diagnostic Medical Sonographer (RDMS)",4,104,"American Registry for Diagnostic Medical Sonography",{"$f":"VLOOKUP(B105,Certifications!$A$2:$D$844,4,FALSE)","v":"www.ardms.org"}]
[105,"ARDMS003","(ARDMS003) Registered Vascular Technologist","Registered Vascular Technologist",4,105,"American Registry for Diagnostic Medical Sonography",{"$f":"VLOOKUP(B106,Certifications!$A$2:$D$844,4,FALSE)","v":"www.ardms.org"}]
[106,"AWELD003","(AWELD003) AWS Certified Welder - FCAW Plate","AWS Certified Welder - FCAW Plate",2,106,"American Welding Society",{"$f":"VLOOKUP(B107,Certifications!$A$2:$D$844,4,FALSE)","v":"www.aws.org"}]
[107,"AWELD004","(AWELD004) AWS Certified Welder - GMAW Plate","AWS Certified Welder - GMAW Plate",2,107,"American Welding Society",{"$f":"VLOOKUP(B108,Certifications!$A$2:$D$844,4,FALSE)","v":"www.aws.org"}]
[108,"AWELD005","(AWELD005) AWS Certified Welder - GTAW Pipe (Carbon Steel)","AWS Certified Welder - GTAW Pipe (Carbon Steel)",2,108,"American Welding Society",{"$f":"VLOOKUP(B109,Certifications!$A$2:$D$844,4,FALSE)","v":"www.aws.org"}]
[109,"AWELD006","(AWELD006) AWS Certified Welder - GTAW Pipe (Stainless Steel to Carbon Steel)","AWS Certified Welder - GTAW Pipe (Stainless Steel to Carbon Steel)",2,109,"American Welding Society",{"$f":"VLOOKUP(B110,Certifications!$A$2:$D$844,4,FALSE)","v":"www.aws.org"}]
[110,"AWELD007","(AWELD007) AWS Certified Welder - GTAW Pipe (Stainless Steel)","AWS Certified Welder - GTAW Pipe (Stainless Steel)",2,110,"American Welding Society",{"$f":"VLOOKUP(B111,Certifications!$A$2:$D$844,4,FALSE)","v":"www.aws.org"}]
[111,"AWELD008","(AWELD008) AWS Certified Welder - GTAW Plate","AWS Certified Welder - GTAW Plate",2,111,"American Welding Society",{"$f":"VLOOKUP(B112,Certifications!$A$2:$D$844,4,FALSE)","v":"www.aws.org"}]
[112,"AWELD009","(AWELD009) AWS Certified Welder - GTAW/SMAW Pipe (Carbon Steel)","AWS Certified Welder - GTAW/SMAW Pipe (Carbon Steel)",2,112,"American Welding Society",{"$f":"VLOOKUP(B113,Certifications!$A$2:$D$844,4,FALSE)","v":"www.aws.org"}]
[113,"AWELD010","(AWELD010) AWS Certified Welder - GTAW/SMAW Pipe (Chrome PWHT)","AWS Certified Welder - GTAW/SMAW Pipe (Chrome PWHT)",2,113,"American Welding Society",{"$f":"VLOOKUP(B114,Certifications!$A$2:$D$844,4,FALSE)","v":"www.aws.org"}]
[114,"AWELD011","(AWELD011) AWS Certified Welder - SMAW Pipe","AWS Certified Welder - SMAW Pipe",2,114,"American Welding Society",{"$f":"VLOOKUP(B115,Certifications!$A$2:$D$844,4,FALSE)","v":"www.aws.org"}]
[115,"AWELD012","(AWELD012) AWS Certified Welder - SMAW Plate","AWS Certified Welder - SMAW Plate",2,115,"American Welding Society",{"$f":"VLOOKUP(B116,Certifications!$A$2:$D$844,4,FALSE)","v":"www.aws.org"}]
[116,"BNENT001","(BNENT001) Certified Hemodialysis Technologist/Technician","Certified Hemodialysis Technologist/Technician",2,116,"Board of Nephrology Examiners Inc. Nursing and Technology",{"$f":"VLOOKUP(B117,Certifications!$A$2:$D$844,4,FALSE)","v":"www.bonent.org/"}]
[117,"CARCH002","(CARCH002) Chief Architect Certified Apprentice","Chief Architect Certified Apprentice",1,117,"Chief Architect, Inc.",{"$f":"VLOOKUP(B118,Certifications!$A$2:$D$844,4,FALSE)","v":"www.chiefarchitect.com"}]
[118,"CBFDM001","(CBFDM001) Certified Dietary Manager (CDM)","Certified Dietary Manager (CDM)",1,118,"Certifying Board for Dietary Managers",{"$f":"VLOOKUP(B119,Certifications!$A$2:$D$844,4,FALSE)","v":"www.dmaonline.org/"}]
[119,"CCINT002","(CCINT002) Registered Cardiac Sonographer (RCS)","Registered Cardiac Sonographer (RCS)",4,119,"Cardiovascular Credentialing International",{"$f":"VLOOKUP(B120,Certifications!$A$2:$D$844,4,FALSE)","v":"www.cci-online.org"}]
[120,"CCINT003","(CCINT003) Registered Cardiovascular Invasive Specialist","Registered Cardiovascular Invasive Specialist",4,120,"Cardiovascular Credentialing International",{"$f":"VLOOKUP(B121,Certifications!$A$2:$D$844,4,FALSE)","v":"www.cci-online.org"}]
[121,"CCINT004","(CCINT004) Registered Vascular Specialist","Registered Vascular Specialist",4,121,"Cardiovascular Credentialing International",{"$f":"VLOOKUP(B122,Certifications!$A$2:$D$844,4,FALSE)","v":"www.cci-online.org"}]
[122,"CDREG001","(CDREG001) Dietetic Technician, Registered (DTR)","Dietetic Technician, Registered (DTR)",4,122,"Commission on Dietetic Registration",{"$f":"VLOOKUP(B123,Certifications!$A$2:$D$844,4,FALSE)","v":"www.cdrnet.org/"}]
[123,"CDREG002","(CDREG002) Registered Dietician","Registered Dietician",1,123,"Commission on Dietetic Registration",{"$f":"VLOOKUP(B124,Certifications!$A$2:$D$844,4,FALSE)","v":"www.cdrnet.org/"}]
[124,"CERHB001","(CERHB001) Biotechnician Assistant","Biotechnician Assistant",1,124,"Center for Excellence for Regenerative Health Biotechnology at University of Florida",{"$f":"VLOOKUP(B125,Certifications!$A$2:$D$844,4,FALSE)","v":"http://www.cerhb.ufl.edu/"}]
[125,"CERTI002","(CERTI002) Entrepreneurship & Small Business","Entrepreneurship & Small Business",1,125,"Certiport, A Pearson VUE Business",{"$f":"VLOOKUP(B126,Certifications!$A$2:$D$844,4,FALSE)","v":"www.certiport.com"}]
[126,"CEWFD001","(CEWFD001) Energy Industry Fundamentals Certificate","Energy Industry Fundamentals Certificate",1,126,"Center for Energy Workforce Development",{"$f":"VLOOKUP(B127,Certifications!$A$2:$D$844,4,FALSE)","v":"http://www.cewd.org/curriculum"}]
[127,"CIDIN001","(CIDIN001) Certified Interior Decorator","Certified Interior Decorator",1,127,"Certified Interior Decorators International (C.I.D.)",{"$f":"VLOOKUP(B128,Certifications!$A$2:$D$844,4,FALSE)","v":"www.cidinternational.org"}]
[128,"CINST001","(CINST001) C++ Certified Associate Programmer (CPA)","C++ Certified Associate Programmer (CPA)",1,128,"C++ Institute",{"$f":"VLOOKUP(B129,Certifications!$A$2:$D$844,4,FALSE)","v":"http://cppinstitute.org/"}]
[129,"CISCO001","(CISCO001) Cisco Certified Design Associate (CCDA)","Cisco Certified Design Associate (CCDA)",2,129,"Cisco Systems, Inc.",{"$f":"VLOOKUP(B130,Certifications!$A$2:$D$844,4,FALSE)","v":"www.cisco.com"}]
[130,"CISCO002","(CISCO002) Cisco Certified Design Professional (CCDP)","Cisco Certified Design Professional (CCDP)",2,130,"Cisco Systems, Inc.",{"$f":"VLOOKUP(B131,Certifications!$A$2:$D$844,4,FALSE)","v":"www.cisco.com"}]
[131,"CISCO003","(CISCO003) Cisco Certified Entry Network Technician (CCENT)","Cisco Certified Entry Network Technician (CCENT)",1,131,"Cisco Systems, Inc.",{"$f":"VLOOKUP(B132,Certifications!$A$2:$D$844,4,FALSE)","v":"www.cisco.com"}]
[132,"CISCO004","(CISCO004) Cisco Certified Network Associate (CCNA)","Cisco Certified Network Associate (CCNA)",2,132,"Cisco Systems, Inc.",{"$f":"VLOOKUP(B133,Certifications!$A$2:$D$844,4,FALSE)","v":"www.cisco.com"}]
[133,"CISCO005","(CISCO005) Cisco Certified Network Professional (CCNP)","Cisco Certified Network Professional (CCNP)",2,133,"Cisco Systems, Inc.",{"$f":"VLOOKUP(B134,Certifications!$A$2:$D$844,4,FALSE)","v":"www.cisco.com"}]
[134,"CISCO009","(CISCO009) Cisco Certified Architect","Cisco Certified Architect",2,134,"Cisco Systems, Inc.",{"$f":"VLOOKUP(B135,Certifications!$A$2:$D$844,4,FALSE)","v":"www.cisco.com"}]
[135,"CISCO010","(CISCO010) Cisco Certified Design Expert (CCDE)","Cisco Certified Design Expert (CCDE)",2,135,"Cisco Systems, Inc.",{"$f":"VLOOKUP(B136,Certifications!$A$2:$D$844,4,FALSE)","v":"www.cisco.com"}]
[136,"CISCO011","(CISCO011) Cisco Certified Network Associate Security (CCNA Security)","Cisco Certified Network Associate Security (CCNA Security)",2,136,"Cisco Systems, Inc.",{"$f":"VLOOKUP(B137,Certifications!$A$2:$D$844,4,FALSE)","v":"www.cisco.com"}]
[137,"CISCO013","(CISCO013) Cisco Certified Network Associate Wireless (CCNA Wireless)","Cisco Certified Network Associate Wireless (CCNA Wireless)",2,137,"Cisco Systems, Inc.",{"$f":"VLOOKUP(B138,Certifications!$A$2:$D$844,4,FALSE)","v":"www.cisco.com"}]
[138,"CISCO017","(CISCO017) Cisco Certified Network Professional Wireless (CCNP Wireless)","Cisco Certified Network Professional Wireless (CCNP Wireless)",2,138,"Cisco Systems, Inc.",{"$f":"VLOOKUP(B139,Certifications!$A$2:$D$844,4,FALSE)","v":"www.cisco.com"}]
[139,"CISCO018","(CISCO018) Cisco Certified Internetwork Expert Routing and Switching (CCIE Routing & Switching)","Cisco Certified Internetwork Expert Routing and Switching (CCIE Routing & Switching)",2,139,"Cisco Systems, Inc.",{"$f":"VLOOKUP(B140,Certifications!$A$2:$D$844,4,FALSE)","v":"www.cisco.com"}]
[140,"CISCO019","(CISCO019) Cisco Certified Internetwork Expert Security (CCIE Security)","Cisco Certified Internetwork Expert Security (CCIE Security)",2,140,"Cisco Systems, Inc.",{"$f":"VLOOKUP(B141,Certifications!$A$2:$D$844,4,FALSE)","v":"www.cisco.com"}]
[141,"CISCO024","(CISCO024) Cisco Certified Network Associate Routing and Switching (CCNA Routing and Switching)","Cisco Certified Network Associate Routing and Switching (CCNA Routing and Switching)",2,141,"Cisco Systems, Inc.",{"$f":"VLOOKUP(B142,Certifications!$A$2:$D$844,4,FALSE)","v":"www.cisco.com"}]
[142,"CISCO025","(CISCO025) Cisco Certified Network Associate Cyber Ops (CCNA Cyber Ops)","Cisco Certified Network Associate Cyber Ops (CCNA Cyber Ops)",2,142,"Cisco Systems, Inc.",{"$f":"VLOOKUP(B143,Certifications!$A$2:$D$844,4,FALSE)","v":"www.cisco.com"}]
[143,"CISCO026","(CISCO026) Cisco Certified Network Associate (CCNA)","Cisco Certified Network Associate (CCNA)",1,143,"Cisco Systems",{"$f":"VLOOKUP(B144,Certifications!$A$2:$D$844,4,FALSE)","v":"www.cisco.com"}]
[144,"CITRX004","(CITRX004) Citrix Certified Administrator (CCA)- XenApp","Citrix Certified Administrator (CCA)- XenApp",2,144,"Citrix Systems Incorporated",{"$f":"VLOOKUP(B145,Certifications!$A$2:$D$844,4,FALSE)","v":"www.citrixtraining.com"}]
[145,"CNCSI001","(CNCSI001) Mastercam Certified Programmer Mill Level 1 (CPgM1)","Mastercam Certified Programmer Mill Level 1 (CPgM1)",2,145,"CNC Software Inc.",{"$f":"VLOOKUP(B146,Certifications!$A$2:$D$844,4,FALSE)","v":"www.mastercamu.com"}]
[146,"CNCSI002","(CNCSI002) Mastercam Associate Certification - Mill Design and Toolpaths","Mastercam Associate Certification - Mill Design and Toolpaths",2,146,"CNC Software Inc.",{"$f":"VLOOKUP(B147,Certifications!$A$2:$D$844,4,FALSE)","v":"www.mastercamu.com"}]
[147,"COMPT001","(COMPT001) CompTIA A+","CompTIA A+",2,147,"Computing Technology Industry Association (CompTIA)",{"$f":"VLOOKUP(B148,Certifications!$A$2:$D$844,4,FALSE)","v":"www.comptia.org"}]
[148,"COMPT002","(COMPT002) CompTIA CDIA+","CompTIA CDIA+",1,148,"Computing Technology Industry Association (CompTIA )",{"$f":"VLOOKUP(B149,Certifications!$A$2:$D$844,4,FALSE)","v":"www.comptia.org"}]
[149,"COMPT005","(COMPT005) CompTIA Linux+","CompTIA Linux+",2,149,"Computing Technology Industry Association (CompTIA)",{"$f":"VLOOKUP(B150,Certifications!$A$2:$D$844,4,FALSE)","v":"www.comptia.org"}]
[150,"COMPT006","(COMPT006) CompTIA Network+","CompTIA Network+",2,150,"Computing Technology Industry Association (CompTIA)",{"$f":"VLOOKUP(B151,Certifications!$A$2:$D$844,4,FALSE)","v":"www.comptia.org"}]
[151,"COMPT007","(COMPT007) CompTIA Project+","CompTIA Project+",2,151,"Computing Technology Industry Association (CompTIA)",{"$f":"VLOOKUP(B152,Certifications!$A$2:$D$844,4,FALSE)","v":"www.comptia.org"}]
[152,"COMPT008","(COMPT008) CompTIA Security+","CompTIA Security+",2,152,"Computing Technology Industry Association (CompTIA)",{"$f":"VLOOKUP(B153,Certifications!$A$2:$D$844,4,FALSE)","v":"www.comptia.org"}]
[153,"COMPT009","(COMPT009) CompTIA Server+","CompTIA Server+",2,153,"Computing Technology Industry Association (CompTIA)",{"$f":"VLOOKUP(B154,Certifications!$A$2:$D$844,4,FALSE)","v":"www.comptia.org"}]
[154,"COMPT014","(COMPT014) CompTIA Cloud+","CompTIA Cloud+",2,154,"Computing Technology Industry Association (CompTIA)",{"$f":"VLOOKUP(B155,Certifications!$A$2:$D$844,4,FALSE)","v":"www.comptia.org"}]
[155,"COMPT016","(COMPT016) CompTIA Cybersecurity Analyst (CySA+)","CompTIA Cybersecurity Analyst (CySA+)",2,155,"Computing Technology Industry Association (CompTIA)",{"$f":"VLOOKUP(B156,Certifications!$A$2:$D$844,4,FALSE)","v":"www.comptia.org"}]
[156,"COMPT017","(COMPT017) CompTIA Advanced Security Practitioner (CASP)","CompTIA Advanced Security Practitioner (CASP)",2,156,"Computing Technology Industry Association (CompTIA )",{"$f":"VLOOKUP(B157,Certifications!$A$2:$D$844,4,FALSE)","v":"www.comptia.org"}]
[157,"COMPT018","(COMPT018) CompTIA IT Fundamentals+","CompTIA IT Fundamentals+",1,157,"Computing Technology Industry Association (CompTIA)",{"$f":"VLOOKUP(B158,Certifications!$A$2:$D$844,4,FALSE)","v":"www.comptia.org"}]
[158,"COMPT019","(COMPT019) CompTIA PenTest+","CompTIA PenTest+",2,158,"Computing Technology Industry Association (CompTIA)",{"$f":"VLOOKUP(B159,Certifications!$A$2:$D$844,4,FALSE)","v":"www.comptia.org"}]
[159,"CPREC001","(CPREC001) Child Development Associate (CDA)","Child Development Associate (CDA)",1,159,"Council for Professional Recognition",{"$f":"VLOOKUP(B160,Certifications!$A$2:$D$844,4,FALSE)","v":"www.cdacouncil.org/"}]
[160,"CPSTL001","(CPSTL001) Check Point Certified Security Administrator (CCSA)","Check Point Certified Security Administrator (CCSA)",2,160,"Check Point Software Technologies Ltd.",{"$f":"VLOOKUP(B161,Certifications!$A$2:$D$844,4,FALSE)","v":"www.checkpoint.com"}]
[161,"CPSTL002","(CPSTL002) Check Point Certified Security Expert (CCSE)","Check Point Certified Security Expert (CCSE)",2,161,"Check Point Software Technologies Ltd.",{"$f":"VLOOKUP(B162,Certifications!$A$2:$D$844,4,FALSE)","v":"www.checkpoint.com"}]
[162,"CSCMP001","(CSCMP001) SCPro Fundamentals Bundle (8 exams)","SCPro Fundamentals Bundle (8 exams)",2,162,"Council of Supply Chain Management Professionals",{"$f":"VLOOKUP(B163,Certifications!$A$2:$D$844,4,FALSE)","v":"cscmp.org"}]
[163,"CWNPT001","(CWNPT001) Certified Wireless Network Administrator (CWNA) ","Certified Wireless Network Administrator (CWNA) ",2,163,"CWNP",{"$f":"VLOOKUP(B164,Certifications!$A$2:$D$844,4,FALSE)","v":"www.cwnp.com"}]
[164,"DANBD001","(DANBD001) Certified Dental Assistant (CDA)","Certified Dental Assistant (CDA)",2,164,"Dental Assisting National Board",{"$f":"VLOOKUP(B165,Certifications!$A$2:$D$844,4,FALSE)","v":"www.dentalassisting.com"}]
[165,"DDSOA001","(DDSOA001) DSA Certified Professional Decorator","DSA Certified Professional Decorator",1,165,"Designer/Decorator Society of America",{"$f":"VLOOKUP(B166,Certifications!$A$2:$D$844,4,FALSE)","v":"www.dsasociety.com/"}]
[166,"DIGIT001","(DIGIT001) STARS GIS Technician","STARS GIS Technician",1,166,"DigitalQuest, Inc.",{"$f":"VLOOKUP(B167,Certifications!$A$2:$D$844,4,FALSE)","v":"www.digitalquest.com/"}]
[167,"EDTSO001","(EDTSO001) ParaPro Assessment","ParaPro Assessment",1,167,"Educational Testing Service",{"$f":"VLOOKUP(B168,Certifications!$A$2:$D$844,4,FALSE)","v":"www.ets.org/parapro"}]
[168,"EMCSQ001","(EMCSQ001) Information Storage and Management (EMCISA) Associate","Information Storage and Management (EMCISA) Associate",2,168,"EMC",{"$f":"VLOOKUP(B169,Certifications!$A$2:$D$844,4,FALSE)","v":"www.education.emc.com"}]
[169,"ENTCP001","(ENTCP001) ETCP Certified Entertainment Electrician","ETCP Certified Entertainment Electrician",2,169,"Entertainment Technician Certification Program (ETCP)",{"$f":"VLOOKUP(B170,Certifications!$A$2:$D$844,4,FALSE)","v":"etcp.plasa.org"}]
[170,"ENTCP002","(ENTCP002) ETCP Certified Rigger – Arena","ETCP Certified Rigger – Arena",1,170,"Entertainment Technician Certification Program (ETCP)",{"$f":"VLOOKUP(B171,Certifications!$A$2:$D$844,4,FALSE)","v":"etcp.plasa.org"}]
[171,"ENTCP003","(ENTCP003) ETCP Certified Rigger – Theatre","ETCP Certified Rigger – Theatre",1,171,"Entertainment Technician Certification Program (ETCP)",{"$f":"VLOOKUP(B172,Certifications!$A$2:$D$844,4,FALSE)","v":"etcp.plasa.org"}]
[172,"ESRIC001","(ESRIC001) ArcGIS Desktop Entry","ArcGIS Desktop Entry",1,172,"ESRI",{"$f":"VLOOKUP(B173,Certifications!$A$2:$D$844,4,FALSE)","v":"www.esri.com"}]
[173,"ETAIN002","(ETAIN002) Fiber Optics Installer (FOI)","Fiber Optics Installer (FOI)",2,173,"Electronics Technician Association International",{"$f":"VLOOKUP(B174,Certifications!$A$2:$D$844,4,FALSE)","v":"www.eta-i.org"}]
[174,"ETAIN008","(ETAIN008) Associate Certified Electronics Technician (CETa)","Associate Certified Electronics Technician (CETa)",2,174,"Electronics Technician Association International",{"$f":"VLOOKUP(B175,Certifications!$A$2:$D$844,4,FALSE)","v":"www.eta-i.org"}]
[175,"ETAIN009","(ETAIN009) Data Cabling Installer Certification (DCIC)","Data Cabling Installer Certification (DCIC)",2,175,"Electronics Technician Association International",{"$f":"VLOOKUP(B176,Certifications!$A$2:$D$844,4,FALSE)","v":"www.eta-i.org"}]
[176,"ETAIN010","(ETAIN010) Fiber Optics Technician (FOT)","Fiber Optics Technician (FOT)",2,176,"Electronics Technician Association International",{"$f":"VLOOKUP(B177,Certifications!$A$2:$D$844,4,FALSE)","v":"www.eta-i.org"}]
[177,"ETAIN011","(ETAIN011) Fiber Optics Technician-Outside Plant (FOT-OSP)","Fiber Optics Technician-Outside Plant (FOT-OSP)",2,177,"Electronics Technician Association International",{"$f":"VLOOKUP(B178,Certifications!$A$2:$D$844,4,FALSE)","v":"www.eta-i.org"}]
[178,"ETAIN012","(ETAIN012) Photonics Technician - Operator (PTO)","Photonics Technician - Operator (PTO)",2,178,"Electronics Technician Association International",{"$f":"VLOOKUP(B179,Certifications!$A$2:$D$844,4,FALSE)","v":"www.eta-i.org"}]
[179,"ETAIN013","(ETAIN013) Photonics Technician Specialist (PTS)","Photonics Technician Specialist (PTS)",2,179,"Electronics Technician Association International",{"$f":"VLOOKUP(B180,Certifications!$A$2:$D$844,4,FALSE)","v":"www.eta-i.org"}]
[180,"ETAIN014","(ETAIN014) Photovoltaic Installer (PVI) - Level 1","Photovoltaic Installer (PVI) - Level 1",2,180,"Electronics Technician Association International",{"$f":"VLOOKUP(B181,Certifications!$A$2:$D$844,4,FALSE)","v":"www.eta-i.org"}]
[181,"ETAIN019","(ETAIN019) Small Wind Installer (SWI) - Level 1","Small Wind Installer (SWI) - Level 1",2,181,"Electronics Technician Association International",{"$f":"VLOOKUP(B182,Certifications!$A$2:$D$844,4,FALSE)","v":"www.eta-i.org"}]
[182,"ETAIN022","(ETAIN022) Specialist in Precision Optics (SPO)","Specialist in Precision Optics (SPO)",2,182,"Electronics Technician Association International",{"$f":"VLOOKUP(B183,Certifications!$A$2:$D$844,4,FALSE)","v":"www.eta-i.org"}]
[183,"ETAIN023","(ETAIN023) Technician in Precision Optics (TPO)","Technician in Precision Optics (TPO)",2,183,"Electronics Technician Association International",{"$f":"VLOOKUP(B184,Certifications!$A$2:$D$844,4,FALSE)","v":"www.eta-i.org"}]
[184,"FASMB001","(FASMB001) Massage & Bodywork Licensing Examination (MBLEx)","Massage & Bodywork Licensing Examination (MBLEx)",4,184,"Federation of State Massage Therapy Boards",{"$f":"VLOOKUP(B185,Certifications!$A$2:$D$844,4,FALSE)","v":"www.fsmtb.org/"}]
[185,"FDFCC001","(FDFCC001) Licensed Funeral Director","Licensed Funeral Director",1,185,"Florida Department of Financial Services, Division of Funeral, Cemetery & Consumer Services",{"$f":"VLOOKUP(B186,Certifications!$A$2:$D$844,4,FALSE)","v":"www.fldfs.com/funeralcemetery/"}]
[186,"FDLIC004","(FDLIC004) Security Officer (Class D)","Security Officer (Class D)",1,186,"Florida Department of Agriculture and Consumer Services, Division of Licensing",{"$f":"VLOOKUP(B187,Certifications!$A$2:$D$844,4,FALSE)","v":"licgweb.doacs.state.fl.us/"}]
[187,"FDMQA001","(FDMQA001) Basic X-Ray Machine Operator","Basic X-Ray Machine Operator",1,187,"Florida Department of Health",{"$f":"VLOOKUP(B188,Certifications!$A$2:$D$844,4,FALSE)","v":"www.doh.state.fl.us/mqa/"}]
[188,"FDMQA002","(FDMQA002) Certified Nursing Assistant (CNA)","Certified Nursing Assistant (CNA)",2,188,"Florida Department of Health",{"$f":"VLOOKUP(B189,Certifications!$A$2:$D$844,4,FALSE)","v":"www.doh.state.fl.us/mqa/"}]
[189,"FDMQA010","(FDMQA010) Licensed Dental Hygienist","Licensed Dental Hygienist",4,189,"Florida Department of Health",{"$f":"VLOOKUP(B190,Certifications!$A$2:$D$844,4,FALSE)","v":"www.doh.state.fl.us/mqa/"}]
[190,"FDMQA014","(FDMQA014) Paramedic (EMT-P)","Paramedic (EMT-P)",2,190,"Florida Department of Health",{"$f":"VLOOKUP(B191,Certifications!$A$2:$D$844,4,FALSE)","v":"www.doh.state.fl.us/mqa/"}]
[191,"FDMQA018","(FDMQA018) Licensed Physical Therapist Assistant","Licensed Physical Therapist Assistant",4,191,"Florida Department of Health",{"$f":"VLOOKUP(B192,Certifications!$A$2:$D$844,4,FALSE)","v":"www.doh.state.fl.us/mqa/"}]
[192,"FDMQA025","(FDMQA025) Licensed Optician","Licensed Optician",4,192,"Florida Department of Health",{"$f":"VLOOKUP(B193,Certifications!$A$2:$D$844,4,FALSE)","v":"www.doh.state.fl.us/mqa/"}]
[193,"FDMQA030","(FDMQA030) 911 Public Safety Telecommunicator","911 Public Safety Telecommunicator",2,193,"Florida Department of Health",{"$f":"VLOOKUP(B194,Certifications!$A$2:$D$844,4,FALSE)","v":"www.doh.state.fl.us/mqa/"}]
[194,"FDMQA031","(FDMQA031) Local Anesthesia for Dental Hygienists","Local Anesthesia for Dental Hygienists",1,194,"Florida Department of Health",{"$f":"VLOOKUP(B195,Certifications!$A$2:$D$844,4,FALSE)","v":"www.doh.state.fl.us/mqa/"}]
[195,"FEDAA001","(FEDAA001) FAA Air Traffic Control Specialist","FAA Air Traffic Control Specialist",1,195,"Federal Aviation Administration",{"$f":"VLOOKUP(B196,Certifications!$A$2:$D$844,4,FALSE)","v":"www.faa.gov/licenses_certificates/"}]
[196,"FEDAA002","(FEDAA002) FAA Aviation Maintenance Technician - General","FAA Aviation Maintenance Technician - General",2,196,"Federal Aviation Administration",{"$f":"VLOOKUP(B197,Certifications!$A$2:$D$844,4,FALSE)","v":"www.faa.gov/licenses_certificates/"}]
[197,"FEDAA004","(FEDAA004) FAA Aviation Mechanic Technician - Airframe","FAA Aviation Mechanic Technician - Airframe",2,197,"Federal Aviation Administration",{"$f":"VLOOKUP(B198,Certifications!$A$2:$D$844,4,FALSE)","v":"www.faa.gov/licenses_certificates/"}]
[198,"FEDAA005","(FEDAA005) FAA Certified Flight Instructor License","FAA Certified Flight Instructor License",1,198,"Federal Aviation Administration",{"$f":"VLOOKUP(B199,Certifications!$A$2:$D$844,4,FALSE)","v":"www.faa.gov/licenses_certificates/"}]
[199,"FEDAA006","(FEDAA006) FAA Commercial Pilot","FAA Commercial Pilot",1,199,"Federal Aviation Administration",{"$f":"VLOOKUP(B200,Certifications!$A$2:$D$844,4,FALSE)","v":"www.faa.gov/licenses_certificates/"}]
[200,"FEDAA010","(FEDAA010) FAA Aviation Maintenance Technician - Powerplant","FAA Aviation Maintenance Technician - Powerplant",2,200,"Federal Aviation Administration",{"$f":"VLOOKUP(B201,Certifications!$A$2:$D$844,4,FALSE)","v":"www.faa.gov/licenses_certificates/"}]
[201,"FEDAA011","(FEDAA011) FAA Private Pilot","FAA Private Pilot",1,201,"Federal Aviation Administration",{"$f":"VLOOKUP(B202,Certifications!$A$2:$D$844,4,FALSE)","v":"www.faa.gov/licenses_certificates/"}]
[202,"FEDAA013","(FEDAA013) FAA Ground School","FAA Ground School",1,202,"Federal Aviation Administration",{"$f":"VLOOKUP(B203,Certifications!$A$2:$D$844,4,FALSE)","v":"www.faa.gov/licenses_certificates/"}]
[203,"FEDCC001","(FEDCC001) FCC General Radiotelephone Operator License (PG)","FCC General Radiotelephone Operator License (PG)",1,203,"Federal Communications Commission",{"$f":"VLOOKUP(B204,Certifications!$A$2:$D$844,4,FALSE)","v":"wireless.fcc.gov/commoperators/pg.html"}]
[204,"FLADA001","(FLADA001) Florida Automobile Dealers Association (FADA) Certified Technician","Florida Automobile Dealers Association (FADA) Certified Technician",1,204,"Florida Automobile Dealers Association",{"$f":"VLOOKUP(B205,Certifications!$A$2:$D$844,4,FALSE)","v":"www.flada.org"}]
[205,"FLDAS002","(FLDAS002) License - Customer Representative (4-40)","License - Customer Representative (4-40)",1,205,"Florida Department of Financial Services, Division of Agent and Agency Services",{"$f":"VLOOKUP(B206,Certifications!$A$2:$D$844,4,FALSE)","v":"www.myfloridacfo.com/Agents/"}]
[206,"FLDAS003","(FLDAS003) License - General Lines Agent (2-20)","License - General Lines Agent (2-20)",1,206,"Florida Department of Financial Services, Division of Agent and Agency Services",{"$f":"VLOOKUP(B207,Certifications!$A$2:$D$844,4,FALSE)","v":"www.myfloridacfo.com/Agents/"}]
[207,"FLDAS006","(FLDAS006) License - Life, Health and Annuities","License - Life, Health and Annuities",1,207,"Florida Department of Financial Services, Division of Agent and Agency Services",{"$f":"VLOOKUP(B208,Certifications!$A$2:$D$844,4,FALSE)","v":"www.myfloridacfo.com/Agents/"}]
[208,"FLDCF001","(FLDCF001) Director Credential","Director Credential",1,208,"Florida Department of Children and Families, Child Care Services",{"$f":"VLOOKUP(B209,Certifications!$A$2:$D$844,4,FALSE)","v":"www.dcf.state.fl.us/childcare/"}]
[209,"FLDCF003","(FLDCF003) Florida Child Care Professional Credential","Florida Child Care Professional Credential",1,209,"Florida Department of Children and Families, Child Care Services",{"$f":"VLOOKUP(B210,Certifications!$A$2:$D$844,4,FALSE)","v":"www.dcf.state.fl.us/childcare/"}]
[210,"FLDCF005","(FLDCF005) Staff Credential","Staff Credential",1,210,"Florida Department of Children and Families, Child Care Services",{"$f":"VLOOKUP(B211,Certifications!$A$2:$D$844,4,FALSE)","v":"www.dcf.state.fl.us/childcare/"}]
[211,"FLDCF006","(FLDCF006) VPK Director Credential","VPK Director Credential",1,211,"Florida Department of Children and Families, Child Care Services",{"$f":"VLOOKUP(B212,Certifications!$A$2:$D$844,4,FALSE)","v":"www.dcf.state.fl.us/childcare/"}]
[212,"FLDDL001","(FLDDL001) Commercial Driver License (CDL)","Commercial Driver License (CDL)",1,212,"Florida Department of Highway Safety and Motor Vehicles, Division of Driver Licenses",{"$f":"VLOOKUP(B213,Certifications!$A$2:$D$844,4,FALSE)","v":"www.hsmv.state.fl.us/html/dlnew.html"}]
[213,"FLDEP001","(FLDEP001) Wastewater Treatment Plant Operator Level A","Wastewater Treatment Plant Operator Level A",1,213,"Florida Department of Environmental Protection",{"$f":"VLOOKUP(B214,Certifications!$A$2:$D$844,4,FALSE)","v":"www.dep.state.fl.us/"}]
[214,"FLDEP002","(FLDEP002) Wastewater Treatment Plant Operator Level B","Wastewater Treatment Plant Operator Level B",1,214,"Florida Department of Environmental Protection",{"$f":"VLOOKUP(B215,Certifications!$A$2:$D$844,4,FALSE)","v":"www.dep.state.fl.us/"}]
[215,"FLDEP003","(FLDEP003) Wastewater Treatment Plant Operator Level C","Wastewater Treatment Plant Operator Level C",1,215,"Florida Department of Environmental Protection",{"$f":"VLOOKUP(B216,Certifications!$A$2:$D$844,4,FALSE)","v":"www.dep.state.fl.us/"}]
[216,"FLDEP004","(FLDEP004) Water Treatment Plant Operator Level A","Water Treatment Plant Operator Level A",1,216,"Florida Department of Environmental Protection",{"$f":"VLOOKUP(B217,Certifications!$A$2:$D$844,4,FALSE)","v":"www.dep.state.fl.us/"}]
[217,"FLDEP005","(FLDEP005) Water Treatment Plant Operator Level B","Water Treatment Plant Operator Level B",1,217,"Florida Department of Environmental Protection",{"$f":"VLOOKUP(B218,Certifications!$A$2:$D$844,4,FALSE)","v":"www.dep.state.fl.us/"}]
[218,"FLDEP006","(FLDEP006) Water Treatment Plant Operator Level C","Water Treatment Plant Operator Level C",1,218,"Florida Department of Environmental Protection",{"$f":"VLOOKUP(B219,Certifications!$A$2:$D$844,4,FALSE)","v":"www.dep.state.fl.us/"}]
[219,"FLDLE001","(FLDLE001) Auxiliary Law Enforcement Officer","Auxiliary Law Enforcement Officer",1,219,"Florida Department of Law Enforcement, Criminal Justice Standards and Training Commission",{"$f":"VLOOKUP(B220,Certifications!$A$2:$D$844,4,FALSE)","v":"www.fdle.state.fl.us/cjst/commission/"}]
[220,"FLDLE002","(FLDLE002) Correctional Officer","Correctional Officer",2,220,"Florida Department of Law Enforcement, Criminal Justice Standards and Training Commission",{"$f":"VLOOKUP(B221,Certifications!$A$2:$D$844,4,FALSE)","v":"www.fdle.state.fl.us/cjst/commission/"}]
[221,"FLDLE003","(FLDLE003) Correctional Probation Officer","Correctional Probation Officer",2,221,"Florida Department of Law Enforcement, Criminal Justice Standards and Training Commission",{"$f":"VLOOKUP(B222,Certifications!$A$2:$D$844,4,FALSE)","v":"www.fdle.state.fl.us/cjst/commission/"}]
[222,"FLDLE004","(FLDLE004) Law Enforcement Officer","Law Enforcement Officer",2,222,"Florida Department of Law Enforcement, Criminal Justice Standards and Training Commission",{"$f":"VLOOKUP(B223,Certifications!$A$2:$D$844,4,FALSE)","v":"www.fdle.state.fl.us/cjst/commission/"}]
[223,"FLDOE001","(FLDOE001) Early Childhood Professional Certificate (ECPC)","Early Childhood Professional Certificate (ECPC)",1,223,"Florida Department of Education",{"$f":"VLOOKUP(B224,Certifications!$A$2:$D$844,4,FALSE)","v":"www.fldoe.org"}]
[224,"FLDOE002","(FLDOE002) School Age Professional Certificate (SAPC)","School Age Professional Certificate (SAPC)",1,224,"Florida Department of Education",{"$f":"VLOOKUP(B225,Certifications!$A$2:$D$844,4,FALSE)","v":"www.fldoe.org"}]
[225,"FLDOP001","(FLDOP001) Barber","Barber",1,225,"Florida Department of Business and Professional Regulation, Division of Professions",{"$f":"VLOOKUP(B226,Certifications!$A$2:$D$844,4,FALSE)","v":"www.myfloridalicense.com/dbpr/pro/index.html"}]
[226,"FLDOP002","(FLDOP002) Cosmetologist","Cosmetologist",1,226,"Florida Department of Business and Professional Regulation, Division of Professions",{"$f":"VLOOKUP(B227,Certifications!$A$2:$D$844,4,FALSE)","v":"www.myfloridalicense.com/dbpr/pro/index.html"}]
[227,"FLDOP007","(FLDOP007) Restricted Barber","Restricted Barber",1,227,"Florida Department of Business and Professional Regulation, Division of Professions",{"$f":"VLOOKUP(B228,Certifications!$A$2:$D$844,4,FALSE)","v":"www.myfloridalicense.com/dbpr/pro/index.html"}]
[228,"FLDOP008","(FLDOP008) Nail Specialist","Nail Specialist",1,228,"Florida Department of Business and Professional Regulation, Division of Professions",{"$f":"VLOOKUP(B229,Certifications!$A$2:$D$844,4,FALSE)","v":"www.myfloridalicense.com/dbpr/pro/index.html"}]
[229,"FLDOP009","(FLDOP009) Facial Specialist","Facial Specialist",1,229,"Florida Department of Business and Professional Regulation, Division of Professions",{"$f":"VLOOKUP(B230,Certifications!$A$2:$D$844,4,FALSE)","v":"www.myfloridalicense.com/dbpr/pro/index.html"}]
[230,"FLDOT001","(FLDOT001) Maintenance of Traffic (MOT) Certification","Maintenance of Traffic (MOT) Certification",1,230,"Florida Department of Transportation",{"$f":"VLOOKUP(B231,Certifications!$A$2:$D$844,4,FALSE)","v":"http://www.dot.state.fl.us/rddesign/MOT/MOT.SHTM"}]
[231,"FLFBR001","(FLFBR001) Agritechnology Specialist Certification","Agritechnology Specialist Certification",1,231,"Agricultural Education Services and Technology Inc.",{"$f":"VLOOKUP(B232,Certifications!$A$2:$D$844,4,FALSE)","v":"certify.ag/"}]
[232,"FLFBR005","(FLFBR005) Animal Science Specialist Certification","Animal Science Specialist Certification",1,232,"Agricultural Education Services and Technology Inc.",{"$f":"VLOOKUP(B233,Certifications!$A$2:$D$844,4,FALSE)","v":"certify.ag/"}]
[233,"FLFBR007","(FLFBR007) Agriculture Associate Certification","Agriculture Associate Certification",1,233,"Agricultural Education Services and Technology Inc.",{"$f":"VLOOKUP(B234,Certifications!$A$2:$D$844,4,FALSE)","v":"certify.ag/"}]
[234,"FLSFM002","(FLSFM002) Certified Fire Fighter","Certified Fire Fighter",1,234,"Florida Department of Financial Services, State Fire Marshal, Bureau of Fire Standards & Training",{"$f":"VLOOKUP(B235,Certifications!$A$2:$D$844,4,FALSE)","v":"www.myfloridacfo.com/Division/SFM/"}]
[235,"FLSFM005","(FLSFM005) Fire Fighter I","Fire Fighter I",1,235,"Florida Department of Financial Services, State Fire Marshal, Bureau of Fire Standards & Training",{"$f":"VLOOKUP(B236,Certifications!$A$2:$D$844,4,FALSE)","v":"www.myfloridacfo.com/Division/SFM/"}]
[236,"FLSFM006","(FLSFM006) Fire Fighter II","Fire Fighter II",2,236,"Florida Department of Financial Services, State Fire Marshal, Bureau of Fire Standards & Training",{"$f":"VLOOKUP(B237,Certifications!$A$2:$D$844,4,FALSE)","v":"www.myfloridacfo.com/Division/SFM/"}]
[237,"FLSFM007","(FLSFM007) Fire Safety Inspector I","Fire Safety Inspector I",2,237,"Florida Department of Financial Services, State Fire Marshal, Bureau of Fire Standards & Training",{"$f":"VLOOKUP(B238,Certifications!$A$2:$D$844,4,FALSE)","v":"www.myfloridacfo.com/Division/SFM/"}]
[238,"FLSFM013","(FLSFM013) Fire Officer I","Fire Officer I",1,238,"Florida Department of Financial Services, State Fire Marshal, Bureau of Fire Standards & Training",{"$f":"VLOOKUP(B239,Certifications!$A$2:$D$844,4,FALSE)","v":"www.myfloridacfo.com/Division/SFM/"}]
[239,"FLSFM014","(FLSFM014) Fire Officer II","Fire Officer II",2,239,"Florida Department of Financial Services, State Fire Marshal, Bureau of Fire Standards & Training",{"$f":"VLOOKUP(B240,Certifications!$A$2:$D$844,4,FALSE)","v":"www.myfloridacfo.com/Division/SFM/"}]
[240,"FLSFM016","(FLSFM016) Fire Safety Inspector","Fire Safety Inspector",1,240,"Florida Department of Financial Services, State Fire Marshal, Bureau of Fire Standards & Training",{"$f":"VLOOKUP(B241,Certifications!$A$2:$D$844,4,FALSE)","v":"www.myfloridacfo.com/Division/SFM/"}]
[241,"FLSFM018","(FLSFM018) Fire Instructor I","Fire Instructor I",1,241,"Florida Department of Financial Services, State Fire Marshal, Bureau of Fire Standards & Training",{"$f":"VLOOKUP(B242,Certifications!$A$2:$D$844,4,FALSE)","v":"www.myfloridacfo.com/Division/SFM/"}]
[242,"FLVMA002","(FLVMA002) Certified Veterinary Assistant (CVA)","Certified Veterinary Assistant (CVA)",1,242,"Florida Veterinary Medical Association",{"$f":"VLOOKUP(B243,Certifications!$A$2:$D$844,4,FALSE)","v":"www.fvma.com/"}]
[243,"FMAIN001","(FMAIN001) Precision Sheetmetal Operator - Level I (PSMO)","Precision Sheetmetal Operator - Level I (PSMO)",1,243,"Fabricators & Manufacturers Association, International (FMA)",{"$f":"VLOOKUP(B244,Certifications!$A$2:$D$844,4,FALSE)","v":"www.fmanet.org"}]
[244,"FNGLA001","(FNGLA001) Certified Horticulture Professional","Certified Horticulture Professional",1,244,"Florida Nursery Growers and Landscape Association",{"$f":"VLOOKUP(B245,Certifications!$A$2:$D$844,4,FALSE)","v":"www.fngla.org/"}]
[245,"FNGLA002","(FNGLA002) Certified Landscape Contractor","Certified Landscape Contractor",1,245,"Florida Nursery Growers and Landscape Association",{"$f":"VLOOKUP(B246,Certifications!$A$2:$D$844,4,FALSE)","v":"www.fngla.org/"}]
[246,"FNGLA003","(FNGLA003) Certified Landscape Designer","Certified Landscape Designer",1,246,"Florida Nursery Growers and Landscape Association",{"$f":"VLOOKUP(B247,Certifications!$A$2:$D$844,4,FALSE)","v":"www.fngla.org/"}]
[247,"FNGLA004","(FNGLA004) Certified Landscape Technician","Certified Landscape Technician",1,247,"Florida Nursery Growers and Landscape Association",{"$f":"VLOOKUP(B248,Certifications!$A$2:$D$844,4,FALSE)","v":"www.fngla.org/"}]
[248,"FPARA001","(FPARA001) Certified Florida Paralegal","Certified Florida Paralegal",1,248,"Paralegal Association of Florida",{"$f":"VLOOKUP(B249,Certifications!$A$2:$D$844,4,FALSE)","v":"www.pafinc.org/"}]
[249,"GLIAC001","(GLIAC001) GIAC Certified Forensic Analyst (GCFA)","GIAC Certified Forensic Analyst (GCFA)",2,249,"Global Information Assurance Certification",{"$f":"VLOOKUP(B250,Certifications!$A$2:$D$844,4,FALSE)","v":"www.giac.org"}]
[250,"GLIAC002","(GLIAC002) GIAC Certified Forensic Examiner (GCFE)","GIAC Certified Forensic Examiner (GCFE)",2,250,"Global Information Assurance Certification",{"$f":"VLOOKUP(B251,Certifications!$A$2:$D$844,4,FALSE)","v":"www.giac.org"}]
[251,"GLIAC003","(GLIAC003) GIAC Certified UNIX Security Administrator (GCUX)","GIAC Certified UNIX Security Administrator (GCUX)",2,251,"Global Information Assurance Certification",{"$f":"VLOOKUP(B252,Certifications!$A$2:$D$844,4,FALSE)","v":"www.giac.org"}]
[252,"GLIAC004","(GLIAC004) GIAC Information Security Fundamentals (GISF)","GIAC Information Security Fundamentals (GISF)",2,252,"Global Information Assurance Certification",{"$f":"VLOOKUP(B253,Certifications!$A$2:$D$844,4,FALSE)","v":"www.giac.org"}]
[253,"GLIAC005","(GLIAC005) GIAC Security Essentials (GSEC)","GIAC Security Essentials (GSEC)",2,253,"Global Information Assurance Certification",{"$f":"VLOOKUP(B254,Certifications!$A$2:$D$844,4,FALSE)","v":"www.giac.org"}]
[254,"GRBCI002","(GRBCI002) LEED Green Associate","LEED Green Associate",1,254,"Green Building Certification Institute",{"$f":"VLOOKUP(B255,Certifications!$A$2:$D$844,4,FALSE)","v":"www.gbci.org"}]
[255,"GRBI1002","(GRBI1002) LEED Green Associate","LEED Green Associate",1,255,"US Green Building Council (USGBC)",{"$f":"VLOOKUP(B256,Certifications!$A$2:$D$844,4,FALSE)","v":"www.usgbc.org"}]
[256,"HBINS003","(HBINS003) HBI Pre-Apprenticeship Certificate Training (PACT), Carpentry","HBI Pre-Apprenticeship Certificate Training (PACT), Carpentry",1,256,"Home Builders Institute",{"$f":"VLOOKUP(B257,Certifications!$A$2:$D$844,4,FALSE)","v":"http://www.hbi.org/"}]
[257,"HBINS004","(HBINS004) HBI Pre-Apprenticeship Certificate Training (PACT), Core","HBI Pre-Apprenticeship Certificate Training (PACT), Core",1,257,"Home Builders Institute",{"$f":"VLOOKUP(B258,Certifications!$A$2:$D$844,4,FALSE)","v":"http://www.hbi.org/"}]
[258,"HBINS005","(HBINS005) HBI Pre-Apprenticeship Certificate Training (PACT), Core Green","HBI Pre-Apprenticeship Certificate Training (PACT), Core Green",1,258,"Home Builders Institute",{"$f":"VLOOKUP(B259,Certifications!$A$2:$D$844,4,FALSE)","v":"http://www.hbi.org/"}]
[259,"HBINS006","(HBINS006) HBI Pre-Apprenticeship Certificate Training (PACT), Electrical","HBI Pre-Apprenticeship Certificate Training (PACT), Electrical",1,259,"Home Builders Institute","www.himss.org"]
[260,"HIMSS001","(HIMSS001) Certified Associate in Healthcare Information & Management Systems","Certified Associate in Healthcare Information & Management Systems",4,260,"Healthcare Information and Management Systems Society (HIMSS) ",{"$f":"VLOOKUP(B261,Certifications!$A$2:$D$844,4,FALSE)","v":"www.himss.org"}]
[261,"HVACE001","(HVACE001) HVAC Excellence Employment Ready - Heat Pump","HVAC Excellence Employment Ready - Heat Pump",2,261,"HVAC Excellence",{"$f":"VLOOKUP(B262,Certifications!$A$2:$D$844,4,FALSE)","v":"www.hvacexcellence.org"}]
[262,"HVACE002","(HVACE002) HVAC Excellence EmploymentReady - Air Conditioning","HVAC Excellence EmploymentReady - Air Conditioning",2,262,"HVAC Excellence",{"$f":"VLOOKUP(B263,Certifications!$A$2:$D$844,4,FALSE)","v":"www.hvacexcellence.org"}]
[263,"HVACE003","(HVACE003) HVAC Excellence Employment Ready - Light Commercial Air Conditioning","HVAC Excellence Employment Ready - Light Commercial Air Conditioning",2,263,"HVAC Excellence",{"$f":"VLOOKUP(B264,Certifications!$A$2:$D$844,4,FALSE)","v":"www.hvacexcellence.org"}]
[264,"HVACE004","(HVACE004) HVAC Excellence Employment Ready - Electric Heat","HVAC Excellence Employment Ready - Electric Heat",2,264,"HVAC Excellence",{"$f":"VLOOKUP(B265,Certifications!$A$2:$D$844,4,FALSE)","v":"www.hvacexcellence.org"}]
[265,"HVACE005","(HVACE005) HVAC Excellence Employment Ready - Light Commercial Refrigeration","HVAC Excellence Employment Ready - Light Commercial Refrigeration",2,265,"HVAC Excellence",{"$f":"VLOOKUP(B266,Certifications!$A$2:$D$844,4,FALSE)","v":"www.hvacexcellence.org"}]
[266,"HVACE006","(HVACE006) HVAC Excellence Employment Ready - Gas Heat","HVAC Excellence Employment Ready - Gas Heat",2,266,"HVAC Excellence",{"$f":"VLOOKUP(B267,Certifications!$A$2:$D$844,4,FALSE)","v":"www.hvacexcellence.org"}]
[267,"HVACE011","(HVACE011) HVAC Excellence Employment Ready - Electrical","HVAC Excellence Employment Ready - Electrical",2,267,"HVAC Excellence",{"$f":"VLOOKUP(B268,Certifications!$A$2:$D$844,4,FALSE)","v":"www.hvacexcellence.org"}]
[268,"IACRB001","(IACRB001) Certified Computer Forensics Examiner (CCFE)","Certified Computer Forensics Examiner (CCFE)",1,268,"Information Assurance Certification Review Board",{"$f":"VLOOKUP(B269,Certifications!$A$2:$D$844,4,FALSE)","v":"www.iacertification.org"}]
[269,"IASSC001","(IASSC001) IASSC Certified Black Belt","IASSC Certified Black Belt",2,269,"International Association For Six Sigma Certification",{"$f":"VLOOKUP(B270,Certifications!$A$2:$D$844,4,FALSE)","v":"www.iassc.org"}]
[270,"ICOEC002","(ICOEC002) Certified Ethical Hacker (CEH)","Certified Ethical Hacker (CEH)",2,270,"EC-Council",{"$f":"VLOOKUP(B271,Certifications!$A$2:$D$844,4,FALSE)","v":"www.eccouncil.org/"}]
[271,"ICOEC003","(ICOEC003) Computer Hacking Forensic Investigator (CHFI)","Computer Hacking Forensic Investigator (CHFI)",2,271,"EC-Council",{"$f":"VLOOKUP(B272,Certifications!$A$2:$D$844,4,FALSE)","v":"www.eccouncil.org/"}]
[272,"ICOEC004","(ICOEC004) Certified Security Analyst (ECSA)","Certified Security Analyst (ECSA)",2,272,"EC-Council",{"$f":"VLOOKUP(B273,Certifications!$A$2:$D$844,4,FALSE)","v":"www.eccouncil.org/"}]
[273,"ICOEC005","(ICOEC005) EC-Council Cyber Forensics Associate","EC-Council Cyber Forensics Associate",1,273,"EC-Council",{"$f":"VLOOKUP(B274,Certifications!$A$2:$D$844,4,FALSE)","v":"www.eccouncil.org"}]
[274,"ICOEC006","(ICOEC006) EC-Council Ethical Hacker Associate","EC-Council Ethical Hacker Associate",1,274,"EC-Council",{"$f":"VLOOKUP(B275,Certifications!$A$2:$D$844,4,FALSE)","v":"www.eccouncil.org"}]
[275,"IECON001","(IECON001) Field Service Engineer - Low Voltage Systems","Field Service Engineer - Low Voltage Systems",2,275,"Independent Electrical Contractors",{"$f":"VLOOKUP(B276,Certifications!$A$2:$D$844,4,FALSE)","v":"www.iecfwcc.org"}]
[276,"IECON002","(IECON002) Field Service Engineer - Voice-Data-Video","Field Service Engineer - Voice-Data-Video",2,276,"Independent Electrical Contractors",{"$f":"VLOOKUP(B277,Certifications!$A$2:$D$844,4,FALSE)","v":"www.iecfwcc.org"}]
[277,"IECON003","(IECON003) Journeyman Electrician","Journeyman Electrician",2,277,"Independent Electrical Contractors",{"$f":"VLOOKUP(B278,Certifications!$A$2:$D$844,4,FALSE)","v":"www.iecfwcc.org"}]
[278,"IECON004","(IECON004) Residential Wireman","Residential Wireman",2,278,"Independent Electrical Contractors",{"$f":"VLOOKUP(B279,Certifications!$A$2:$D$844,4,FALSE)","v":"www.iecfwcc.org"}]
[279,"IGCEM001","(IGCEM001) Certified Assistant Turf Equipment Technician","Certified Assistant Turf Equipment Technician",1,279,"International Golf Course Equipment Managers Association",{"$f":"VLOOKUP(B280,Certifications!$A$2:$D$844,4,FALSE)","v":"www.igcema.org"}]
[280,"IHKBZ001","(IHKBZ001) CNC Production Specialist","CNC Production Specialist",2,280,"IHK-Bildungszentrum",{"$f":"VLOOKUP(B281,Certifications!$A$2:$D$844,4,FALSE)","v":"www.machiningtrainingsolutions.com/IHK.html"}]
[281,"IHKBZ002","(IHKBZ002) Electronics Technician for Industrial Engineering","Electronics Technician for Industrial Engineering",1,281,"IHK-Bildungszentrum",{"$f":"VLOOKUP(B282,Certifications!$A$2:$D$844,4,FALSE)","v":"www.machiningtrainingsolutions.com/IHK.html"}]
[282,"IHKBZ004","(IHKBZ004) Mechatronics Fitter","Mechatronics Fitter",1,282,"IHK-Bildungszentrum",{"$f":"VLOOKUP(B283,Certifications!$A$2:$D$844,4,FALSE)","v":"www.machiningtrainingsolutions.com/IHK.html"}]
[283,"IHKBZ005","(IHKBZ005) Precision Machinist","Precision Machinist",1,283,"IHK-Bildungszentrum",{"$f":"VLOOKUP(B284,Certifications!$A$2:$D$844,4,FALSE)","v":"www.machiningtrainingsolutions.com/IHK.html"}]
[284,"IISSC001","(IISSC001) CISSP- Information Systems Security Management Professional (CISSP-ISSMP)","CISSP- Information Systems Security Management Professional (CISSP-ISSMP)",2,284,"International Information Systems Security Certification Consortium, Inc.",{"$f":"VLOOKUP(B285,Certifications!$A$2:$D$844,4,FALSE)","v":"www.isc2.org"}]
[285,"IISSC002","(IISSC002) Systems Security Certified Practitioner (SSCP)","Systems Security Certified Practitioner (SSCP)",2,285,"International Information Systems Security Certification Consortium, Inc.",{"$f":"VLOOKUP(B286,Certifications!$A$2:$D$844,4,FALSE)","v":"www.isc2.org"}]
[286,"IISSC003","(IISSC003) Certified Cyber Forensics Professional (CCFP)","Certified Cyber Forensics Professional (CCFP)",2,286,"International Information Systems Security Certification Consortium, Inc.",{"$f":"VLOOKUP(B287,Certifications!$A$2:$D$844,4,FALSE)","v":"www.isc2.org"}]
[287,"IISSC004","(IISSC004) Certified Information Systems Security Professional (CISSP)","Certified Information Systems Security Professional (CISSP)",2,287,"International Information Systems Security Certification Consortium, Inc.",{"$f":"VLOOKUP(B288,Certifications!$A$2:$D$844,4,FALSE)","v":"www.isc2.org"}]
[288,"INSOC002","(INSOC002) Certified Automation Professional (CAP)","Certified Automation Professional (CAP)",2,288,"International Society of Automation",{"$f":"VLOOKUP(B289,Certifications!$A$2:$D$844,4,FALSE)","v":"www.isa.org"}]
[289,"INSOC005","(INSOC005) Certified Control Systems Technician (CCST) - Level 3","Certified Control Systems Technician (CCST) - Level 3",2,289,"International Society of Automation",{"$f":"VLOOKUP(B290,Certifications!$A$2:$D$844,4,FALSE)","v":"www.isa.org"}]
[290,"INTUT001","(INTUT001) Quickbooks Certified User","Quickbooks Certified User",1,290,"Intuit",{"$f":"VLOOKUP(B291,Certifications!$A$2:$D$844,4,FALSE)","v":"www.intuit.com"}]
[291,"IOEEE002","(IOEEE002) Certified Software Development Associate (CSDA)","Certified Software Development Associate (CSDA)",1,291,"IEEE Computer Society",{"$f":"VLOOKUP(B292,Certifications!$A$2:$D$844,4,FALSE)","v":"www.computer.org"}]
[292,"ISCET001","(ISCET001) Associate Level Certified Electronic Technician","Associate Level Certified Electronic Technician",1,292,"International Society for Certified Electronics Technicians",{"$f":"VLOOKUP(B293,Certifications!$A$2:$D$844,4,FALSE)","v":"www.iscet.org/"}]
[293,"ISCET002","(ISCET002) Electronics System Associate (ESA)","Electronics System Associate (ESA)",2,293,"International Society for Certified Electronics Technicians",{"$f":"VLOOKUP(B294,Certifications!$A$2:$D$844,4,FALSE)","v":"www.iscet.org/"}]
[294,"JCAHO001","(JCAHO001) Certified Ophthalmic Medical Technologist (COMT)","Certified Ophthalmic Medical Technologist (COMT)",4,294,"Joint Commission on Allied Health Personnel in Ophthalmology (JCAHPO)",{"$f":"VLOOKUP(B295,Certifications!$A$2:$D$844,4,FALSE)","v":"www.jcahpo.org/certification/"}]
[295,"JCAHO002","(JCAHO002) Certified Ophthalmic Technician (COT)","Certified Ophthalmic Technician (COT)",4,295,"Joint Commission on Allied Health Personnel in Ophthalmology (JCAHPO)",{"$f":"VLOOKUP(B296,Certifications!$A$2:$D$844,4,FALSE)","v":"www.jcahpo.org/certification/"}]
[296,"LINPI001","(LINPI001) Linux Essentials 010","Linux Essentials 010",1,296,"Linux Professional Institute",{"$f":"VLOOKUP(B297,Certifications!$A$2:$D$844,4,FALSE)","v":"www.lpi.org"}]
[297,"MANSI001","(MANSI001) Manufacturing Technician 1 (MT1)","Manufacturing Technician 1 (MT1)",2,297,"Manufacturing Skills Institute (MSI)",{"$f":"VLOOKUP(B298,Certifications!$A$2:$D$844,4,FALSE)","v":"manufacturingskillsinstitute.org"}]
[298,"MICRO017","(MICRO017) Microsoft Office Specialist Master","Microsoft Office Specialist Master",1,298,"Microsoft Corporation",{"$f":"VLOOKUP(B299,Certifications!$A$2:$D$844,4,FALSE)","v":"www.microsoft.com/learning/en/us/default.aspx"}]
[299,"MICRO052","(MICRO052) Microsoft Certified Trainer (MCT)","Microsoft Certified Trainer (MCT)",2,299,"Microsoft Corporation",{"$f":"VLOOKUP(B300,Certifications!$A$2:$D$844,4,FALSE)","v":"www.microsoft.com/learning/en/us/default.aspx"}]
[300,"MICRO069","(MICRO069) Microsoft Office Specialist (MOS) Bundle Certification (3 of 6)","Microsoft Office Specialist (MOS) Bundle Certification (3 of 6)",1,300,"Microsoft Corporation",{"$f":"VLOOKUP(B301,Certifications!$A$2:$D$844,4,FALSE)","v":"www.microsoft.com/learning/en/us/default.aspx"}]
[301,"MICRO070","(MICRO070) Microsoft Technology Associate (MTA) - Database Administration Fundamentals","Microsoft Technology Associate (MTA) - Database Administration Fundamentals",1,301,"Microsoft Corporation",{"$f":"VLOOKUP(B302,Certifications!$A$2:$D$844,4,FALSE)","v":"www.microsoft.com/learning/en/us/default.aspx"}]
[302,"MICRO074","(MICRO074) Microsoft Technology Associate (MTA) - Software Development Fundamentals","Microsoft Technology Associate (MTA) - Software Development Fundamentals",1,302,"Microsoft Corporation",{"$f":"VLOOKUP(B303,Certifications!$A$2:$D$844,4,FALSE)","v":"www.microsoft.com/learning/en/us/default.aspx"}]
[303,"MICRO076","(MICRO076) Microsoft Technology Associate (MTA) - Windows OS Fundamentals","Microsoft Technology Associate (MTA) - Windows OS Fundamentals",1,303,"Microsoft Corporation",{"$f":"VLOOKUP(B304,Certifications!$A$2:$D$844,4,FALSE)","v":"www.microsoft.com/learning/en/us/default.aspx"}]
[304,"MICRO077","(MICRO077) Microsoft Technology Associate (MTA) - Security Fundamentals","Microsoft Technology Associate (MTA) - Security Fundamentals",1,304,"Microsoft Corporation",{"$f":"VLOOKUP(B305,Certifications!$A$2:$D$844,4,FALSE)","v":"www.microsoft.com/learning/en/us/default.aspx"}]
[305,"MICRO078","(MICRO078) Microsoft Technology Associate (MTA) - Networking Fundamentals","Microsoft Technology Associate (MTA) - Networking Fundamentals",1,305,"Microsoft Corporation",{"$f":"VLOOKUP(B306,Certifications!$A$2:$D$844,4,FALSE)","v":"www.microsoft.com/learning/en/us/default.aspx"}]
[306,"MICRO080","(MICRO080) Microsoft Technology Associate (MTA) - HTML5 Application Developer Fundamentals","Microsoft Technology Associate (MTA) - HTML5 Application Developer Fundamentals",1,306,"Microsoft Corporation",{"$f":"VLOOKUP(B307,Certifications!$A$2:$D$844,4,FALSE)","v":"www.microsoft.com/learning/en/us/default.aspx"}]
[307,"MICRO082","(MICRO082) Microsoft Certified Solutions Associate (MCSA) - SQL Server 2012","Microsoft Certified Solutions Associate (MCSA) - SQL Server 2012",2,307,"Microsoft Corporation",{"$f":"VLOOKUP(B308,Certifications!$A$2:$D$844,4,FALSE)","v":"www.microsoft.com/learning/en/us/default.aspx"}]
[308,"MICRO085","(MICRO085) Microsoft Certified Solutions Associate (MCSA) - Windows Server 2008","Microsoft Certified Solutions Associate (MCSA) - Windows Server 2008",2,308,"Microsoft Corporation",{"$f":"VLOOKUP(B309,Certifications!$A$2:$D$844,4,FALSE)","v":"www.microsoft.com/learning/en/us/default.aspx"}]
[309,"MICRO086","(MICRO086) Microsoft Certified Solutions Associate (MCSA) - Windows Server 2012","Microsoft Certified Solutions Associate (MCSA) - Windows Server 2012",2,309,"Microsoft Corporation",{"$f":"VLOOKUP(B310,Certifications!$A$2:$D$844,4,FALSE)","v":"www.microsoft.com/learning/en/us/default.aspx"}]
[310,"MICRO089","(MICRO089) Microsoft Certified Solutions Expert (MCSE) - Data Platform","Microsoft Certified Solutions Expert (MCSE) - Data Platform",1,310,"Microsoft Corporation",{"$f":"VLOOKUP(B311,Certifications!$A$2:$D$844,4,FALSE)","v":"www.microsoft.com/learning/en/us/default.aspx"}]
[311,"MICRO101","(MICRO101) Microsoft Technology Associate (MTA) - Software Testing Fundamentals","Microsoft Technology Associate (MTA) - Software Testing Fundamentals",1,311,"Microsoft Corporation",{"$f":"VLOOKUP(B312,Certifications!$A$2:$D$844,4,FALSE)","v":"www.microsoft.com/learning/en/us/default.aspx"}]
[312,"MICRO102","(MICRO102) Microsoft Technology Associate (MTA) - Mobility and Devices Fundamentals","Microsoft Technology Associate (MTA) - Mobility and Devices Fundamentals",1,312,"Microsoft Corporation",{"$f":"VLOOKUP(B313,Certifications!$A$2:$D$844,4,FALSE)","v":"www.microsoft.com/learning/en/us/default.aspx"}]
[313,"MICRO103","(MICRO103) Microsoft Technology Associate (MTA) - Intro Programming Using Block-Based Languages","Microsoft Technology Associate (MTA) - Intro Programming Using Block-Based Languages",1,313,"Microsoft Corporation",{"$f":"VLOOKUP(B314,Certifications!$A$2:$D$844,4,FALSE)","v":"www.microsoft.com/learning/en/us/default.aspx"}]
[314,"MICRO106","(MICRO106) Microsoft Certified Solutions Associate (MCSA) - Windows Server 2016","Microsoft Certified Solutions Associate (MCSA) - Windows Server 2016",2,314,"Microsoft Corporation",{"$f":"VLOOKUP(B315,Certifications!$A$2:$D$844,4,FALSE)","v":"www.microsoft.com/learning/en/us/default.aspx"}]
[315,"MICRO107","(MICRO107) Microsoft Certified Solutions Expert (MCSE) - Data Management and Analytics","Microsoft Certified Solutions Expert (MCSE) - Data Management and Analytics",2,315,"Microsoft Corporation",{"$f":"VLOOKUP(B316,Certifications!$A$2:$D$844,4,FALSE)","v":"www.microsoft.com/learning/en/us/default.aspx"}]
[316,"MICRO108","(MICRO108) Microsoft Certified Solutions Expert (MCSE) - Productivity","Microsoft Certified Solutions Expert (MCSE) - Productivity",2,316,"Microsoft Corporation",{"$f":"VLOOKUP(B317,Certifications!$A$2:$D$844,4,FALSE)","v":"www.microsoft.com/learning/en/us/default.aspx"}]
[317,"MICRO109","(MICRO109) Microsoft Certified Solutions Expert (MCSE) - Cloud Platform and Infrastructure","Microsoft Certified Solutions Expert (MCSE) - Cloud Platform and Infrastructure",2,317,"Microsoft Corporation",{"$f":"VLOOKUP(B318,Certifications!$A$2:$D$844,4,FALSE)","v":"www.microsoft.com/learning/en/us/default.aspx"}]
[318,"MICRO110","(MICRO110) Microsoft Certified Solutions Expert (MCSE) - Mobility","Microsoft Certified Solutions Expert (MCSE) - Mobility",2,318,"Microsoft Corporation",{"$f":"VLOOKUP(B319,Certifications!$A$2:$D$844,4,FALSE)","v":"www.microsoft.com/learning/en/us/default.aspx"}]
[319,"MICRO111","(MICRO111) Microsoft Certified Solutions Developer (MCSD) - App Builder","Microsoft Certified Solutions Developer (MCSD) - App Builder",2,319,"Microsoft Corporation",{"$f":"VLOOKUP(B320,Certifications!$A$2:$D$844,4,FALSE)","v":"www.microsoft.com/learning/en/us/default.aspx"}]
[320,"MICRO112","(MICRO112) Microsoft Technology Associate (MTA) - Introduction to Programming Using Python","Microsoft Technology Associate (MTA) - Introduction to Programming Using Python",1,320,"Microsoft Corporation",{"$f":"VLOOKUP(B321,Certifications!$A$2:$D$844,4,FALSE)","v":"www.microsoft.com/learning/en/us/default.aspx"}]
[321,"MICRO113","(MICRO113) Microsoft Technology Associate (MTA) - Cloud Fundamentals","Microsoft Technology Associate (MTA) - Cloud Fundamentals",1,321,"Microsoft Corporation",{"$f":"VLOOKUP(B322,Certifications!$A$2:$D$844,4,FALSE)","v":"www.microsoft.com/learning/en/us/default.aspx"}]
[322,"MICRO114","(MICRO114) Microsoft Technology Associate (MTA) - Introduction to Programming Using Java","Microsoft Technology Associate (MTA) - Introduction to Programming Using Java",1,322,"Microsoft Corporation",{"$f":"VLOOKUP(B323,Certifications!$A$2:$D$844,4,FALSE)","v":"www.microsoft.com/learning/en/us/default.aspx"}]
[323,"MICRO115","(MICRO115) Microsoft Technology Associate (MTA) - Windows Server Administration Fundamentals","Microsoft Technology Associate (MTA) - Windows Server Administration Fundamentals",1,323,"Microsoft Corporation",{"$f":"VLOOKUP(B324,Certifications!$A$2:$D$844,4,FALSE)","v":"www.microsoft.com/learning/en/us/default.aspx"}]
[324,"MSSCN001","(MSSCN001) MSSC Certified Production Technician (CPT)","MSSC Certified Production Technician (CPT)",2,324,"Manufacturing Skills Standards Council (MSSC)",{"$f":"VLOOKUP(B325,Certifications!$A$2:$D$844,4,FALSE)","v":"www.msscusa.org/"}]
[325,"MSSCN002","(MSSCN002) MSSC Certified Logistics Technician (CLT)","MSSC Certified Logistics Technician (CLT)",2,325,"Manufacturing Skills Standards Council (MSSC)",{"$f":"VLOOKUP(B326,Certifications!$A$2:$D$844,4,FALSE)","v":"www.msscusa.org/"}]
[326,"NACFS001","(NACFS001) Modeling & Simulation (M&S) Certification","Modeling & Simulation (M&S) Certification",1,326,"National Center for Simulation",{"$f":"VLOOKUP(B327,Certifications!$A$2:$D$844,4,FALSE)","v":"www.simulationinformation.com/modeling-and-simulation-certification"}]
[327,"NAHUC001","(NAHUC001) Certified Health Unit Coordinator (CHUC)","Certified Health Unit Coordinator (CHUC)",1,327,"National Association of Health Unit Coordinators, Inc.",{"$f":"VLOOKUP(B328,Certifications!$A$2:$D$844,4,FALSE)","v":"www.nahuc.org/"}]
[328,"NASME001","(NASME001) NASM Certified Personal Trainer (CPT)","NASM Certified Personal Trainer (CPT)",4,328,"National Academy of Sports Medicine",{"$f":"VLOOKUP(B329,Certifications!$A$2:$D$844,4,FALSE)","v":"www.nasm.org/"}]
[329,"NATEX001","(NATEX001) Air Conditioning Service Technician","Air Conditioning Service Technician",2,329,"North American Technician Excellence",{"$f":"VLOOKUP(B330,Certifications!$A$2:$D$844,4,FALSE)","v":"www.natex.org/technicians/certification-basics101/"}]
[330,"NATEX002","(NATEX002) Air Conditioning Installation Specialization","Air Conditioning Installation Specialization",2,330,"North American Technician Excellence",{"$f":"VLOOKUP(B331,Certifications!$A$2:$D$844,4,FALSE)","v":"www.natex.org/technicians/certification-basics101/"}]
[331,"NATEX003","(NATEX003) Air to Air Heat Pump Installation Technician","Air to Air Heat Pump Installation Technician",2,331,"North American Technician Excellence",{"$f":"VLOOKUP(B332,Certifications!$A$2:$D$844,4,FALSE)","v":"www.natex.org/technicians/certification-basics101/"}]
[332,"NATEX004","(NATEX004) Air to Air Heat Pump Service Technician","Air to Air Heat Pump Service Technician",2,332,"North American Technician Excellence",{"$f":"VLOOKUP(B333,Certifications!$A$2:$D$844,4,FALSE)","v":"www.natex.org/technicians/certification-basics101/"}]
[333,"NATEX006","(NATEX006) NATEX Industry Competency Exam (ICE) - Light Commercial","NATEX Industry Competency Exam (ICE) - Light Commercial",1,333,"North American Technician Excellence",{"$f":"VLOOKUP(B334,Certifications!$A$2:$D$844,4,FALSE)","v":"www.natex.org/technicians/certification-basics101/"}]
[334,"NATHA002","(NATHA002) Certified EKG Technician (CET)","Certified EKG Technician (CET)",2,334,"National Healthcareer Association",{"$f":"VLOOKUP(B335,Certifications!$A$2:$D$844,4,FALSE)","v":"www.nhanow.com"}]
[335,"NATHA003","(NATHA003) Certified Medical Administrative Assistant (CMAA)","Certified Medical Administrative Assistant (CMAA)",1,335,"National Healthcareer Association",{"$f":"VLOOKUP(B336,Certifications!$A$2:$D$844,4,FALSE)","v":"www.nhanow.com"}]
[336,"NATHA006","(NATHA006) Certified Patient Care Technician (CPCT)","Certified Patient Care Technician (CPCT)",2,336,"National Healthcareer Association",{"$f":"VLOOKUP(B337,Certifications!$A$2:$D$844,4,FALSE)","v":"www.nhanow.com"}]
[337,"NATHA007","(NATHA007) Certified Phlebotomy Technician (CPT)","Certified Phlebotomy Technician (CPT)",1,337,"National Healthcareer Association",{"$f":"VLOOKUP(B338,Certifications!$A$2:$D$844,4,FALSE)","v":"www.nhanow.com"}]
[338,"NATHA008","(NATHA008) Certified Billing & Coding Specialist (CBCS)","Certified Billing & Coding Specialist (CBCS)",2,338,"National Healthcareer Association",{"$f":"VLOOKUP(B339,Certifications!$A$2:$D$844,4,FALSE)","v":"www.nhanow.com"}]
[339,"NATHA009","(NATHA009) Certified Clinical Medical Assistant (CCMA)","Certified Clinical Medical Assistant (CCMA)",2,339,"National Healthcareer Association",{"$f":"VLOOKUP(B340,Certifications!$A$2:$D$844,4,FALSE)","v":"www.nhanow.com"}]
[340,"NATHA010","(NATHA010) Certified Pharmacy Technician (CPhT)","Certified Pharmacy Technician (CPhT)",2,340,"National Healthcareer Association",{"$f":"VLOOKUP(B341,Certifications!$A$2:$D$844,4,FALSE)","v":"www.nhanow.com"}]
[341,"NATHA011","(NATHA011) Certified Electronic Health Record Specialist (CEHRS)","Certified Electronic Health Record Specialist (CEHRS)",1,341,"National Healthcareer Association",{"$f":"VLOOKUP(B342,Certifications!$A$2:$D$844,4,FALSE)","v":"www.nhanow.com"}]
[342,"NBCHT001","(NBCHT001) Colon Hydrotherapy Certification Exam","Colon Hydrotherapy Certification Exam",1,342,"National Board for Colon Hydrotherapy",{"$f":"VLOOKUP(B343,Certifications!$A$2:$D$844,4,FALSE)","v":"www.nbcht.org"}]
[343,"NBCOT001","(NBCOT001) Orthopaedic Technologist Certified (OTC)","Orthopaedic Technologist Certified (OTC)",2,343,"National Board for Certification of Orthopaedic Technologists",{"$f":"VLOOKUP(B344,Certifications!$A$2:$D$844,4,FALSE)","v":"www.nbcot.net"}]
[344,"NBFOT001","(NBFOT001) Certified Occupational Therapy Assistant","Certified Occupational Therapy Assistant",4,344,"National Board for Certification in Occupational Therapy",{"$f":"VLOOKUP(B345,Certifications!$A$2:$D$844,4,FALSE)","v":"www.nbcot.org"}]
[345,"NBFRC001","(NBFRC001) Certified Respiratory Therapist (CRT)","Certified Respiratory Therapist (CRT)",4,345,"National Board for Respiratory Care",{"$f":"VLOOKUP(B346,Certifications!$A$2:$D$844,4,FALSE)","v":"www.nbrc.org"}]
[346,"NBFRC002","(NBFRC002) Registered Respiratory Therapist (RRT)","Registered Respiratory Therapist (RRT)",4,346,"National Board for Respiratory Care",{"$f":"VLOOKUP(B347,Certifications!$A$2:$D$844,4,FALSE)","v":"www.nbrc.org"}]
[347,"NBTMB001","(NBTMB001) Certified Massage Therapist","Certified Massage Therapist",1,347,"National Certification Board of Therapeutic Massage and Bodywork",{"$f":"VLOOKUP(B348,Certifications!$A$2:$D$844,4,FALSE)","v":"www.ncbtmb.com/"}]
[348,"NCATT001","(NCATT001) Aircraft Electronics Technician (AET) ","Aircraft Electronics Technician (AET) ",2,348,"National Center for Aerospace and Transportation Technologies (NCATT)",{"$f":"VLOOKUP(B349,Certifications!$A$2:$D$844,4,FALSE)","v":"www.ncatt.org"}]
[349,"NCATT003","(NCATT003) Aerospace / Aircraft Assembly (AAA)","Aerospace / Aircraft Assembly (AAA)",1,349,"National Center for Aerospace and Transportation Technologies (NCATT)",{"$f":"VLOOKUP(B350,Certifications!$A$2:$D$844,4,FALSE)","v":"www.ncatt.org"}]
[350,"NCCER008","(NCCER008) NCCER Construction Technology (Secondary)","NCCER Construction Technology (Secondary)",1,350,"National Center for Construction Education & Research (NCCER)",{"$f":"VLOOKUP(B351,Certifications!$A$2:$D$844,4,FALSE)","v":"www.nccer.org"}]
[351,"NCCER018","(NCCER018) NCCER HVAC - Level 1 (Secondary)","NCCER HVAC - Level 1 (Secondary)",1,351,"National Center for Construction Education & Research (NCCER)",{"$f":"VLOOKUP(B352,Certifications!$A$2:$D$844,4,FALSE)","v":"www.nccer.org"}]
[352,"NCCER098","(NCCER098) NCCER Manufactured Construction Technology - Level 1 (Secondary)","NCCER Manufactured Construction Technology - Level 1 (Secondary)",1,352,"National Center for Construction Education & Research (NCCER)",{"$f":"VLOOKUP(B353,Certifications!$A$2:$D$844,4,FALSE)","v":"www.nccer.org"}]
[353,"NCCER099","(NCCER099) NCCER Manufactured Construction Technology - Level 2 (Secondary)","NCCER Manufactured Construction Technology - Level 2 (Secondary)",1,353,"National Center for Construction Education & Research (NCCER)",{"$f":"VLOOKUP(B354,Certifications!$A$2:$D$844,4,FALSE)","v":"www.nccer.org"}]
[354,"NCCER201","(NCCER201) NCCER Carpentry - Level 1 (Postsecondary)","NCCER Carpentry - Level 1 (Postsecondary)",1,354,"National Center for Construction Education & Research (NCCER)",{"$f":"VLOOKUP(B355,Certifications!$A$2:$D$844,4,FALSE)","v":"www.nccer.org"}]
[355,"NCCER202","(NCCER202) NCCER Carpentry - Level 2 (Postsecondary)","NCCER Carpentry - Level 2 (Postsecondary)",1,355,"National Center for Construction Education & Research (NCCER)",{"$f":"VLOOKUP(B356,Certifications!$A$2:$D$844,4,FALSE)","v":"www.nccer.org"}]
[356,"NCCER203","(NCCER203) NCCER Carpentry - Level 3 (Postsecondary)","NCCER Carpentry - Level 3 (Postsecondary)",1,356,"National Center for Construction Education & Research (NCCER)",{"$f":"VLOOKUP(B357,Certifications!$A$2:$D$844,4,FALSE)","v":"www.nccer.org"}]
[357,"NCCER204","(NCCER204) NCCER Carpentry - Level 4 (Postsecondary)","NCCER Carpentry - Level 4 (Postsecondary)",1,357,"National Center for Construction Education & Research (NCCER)",{"$f":"VLOOKUP(B358,Certifications!$A$2:$D$844,4,FALSE)","v":"www.nccer.org"}]
[358,"NCCER205","(NCCER205) NCCER Concrete Finishing - Level 1 (Postsecondary)","NCCER Concrete Finishing - Level 1 (Postsecondary)",1,358,"National Center for Construction Education & Research (NCCER)",{"$f":"VLOOKUP(B359,Certifications!$A$2:$D$844,4,FALSE)","v":"www.nccer.org"}]
[359,"NCCER206","(NCCER206) NCCER Concrete Finishing - Level 2 (Postsecondary)","NCCER Concrete Finishing - Level 2 (Postsecondary)",1,359,"National Center for Construction Education & Research (NCCER)",{"$f":"VLOOKUP(B360,Certifications!$A$2:$D$844,4,FALSE)","v":"www.nccer.org"}]
[360,"NCCER207","(NCCER207) NCCER Construction Technology (Postsecondary)","NCCER Construction Technology (Postsecondary)",1,360,"National Center for Construction Education & Research (NCCER)",{"$f":"VLOOKUP(B361,Certifications!$A$2:$D$844,4,FALSE)","v":"www.nccer.org"}]
[361,"NCCER208","(NCCER208) NCCER Electrical - Level 1 (Postsecondary)","NCCER Electrical - Level 1 (Postsecondary)",1,361,"National Center for Construction Education & Research (NCCER)",{"$f":"VLOOKUP(B362,Certifications!$A$2:$D$844,4,FALSE)","v":"www.nccer.org"}]
[362,"NCCER209","(NCCER209) NCCER Electrical - Level 2 (Postsecondary)","NCCER Electrical - Level 2 (Postsecondary)",1,362,"National Center for Construction Education & Research (NCCER)",{"$f":"VLOOKUP(B363,Certifications!$A$2:$D$844,4,FALSE)","v":"www.nccer.org"}]
[363,"NCCER210","(NCCER210) NCCER Electrical - Level 3 (Postsecondary)","NCCER Electrical - Level 3 (Postsecondary)",1,363,"National Center for Construction Education & Research (NCCER)",{"$f":"VLOOKUP(B364,Certifications!$A$2:$D$844,4,FALSE)","v":"www.nccer.org"}]
[364,"NCCER211","(NCCER211) NCCER Electrical - Level 4 (Postsecondary)","NCCER Electrical - Level 4 (Postsecondary)",2,364,"National Center for Construction Education & Research (NCCER)",{"$f":"VLOOKUP(B365,Certifications!$A$2:$D$844,4,FALSE)","v":"www.nccer.org"}]
[365,"NCCER212","(NCCER212) NCCER Electronic Systems Technician - Level 1 (Postsecondary)","NCCER Electronic Systems Technician - Level 1 (Postsecondary)",1,365,"National Center for Construction Education & Research (NCCER)",{"$f":"VLOOKUP(B366,Certifications!$A$2:$D$844,4,FALSE)","v":"www.nccer.org"}]
[366,"NCCER213","(NCCER213) NCCER Electronic Systems Technician - Level 2 (Postsecondary)","NCCER Electronic Systems Technician - Level 2 (Postsecondary)",1,366,"National Center for Construction Education & Research (NCCER)",{"$f":"VLOOKUP(B367,Certifications!$A$2:$D$844,4,FALSE)","v":"www.nccer.org"}]
[367,"NCCER214","(NCCER214) NCCER Electronic Systems Technician - Level 3 (Postsecondary)","NCCER Electronic Systems Technician - Level 3 (Postsecondary)",1,367,"National Center for Construction Education & Research (NCCER)",{"$f":"VLOOKUP(B368,Certifications!$A$2:$D$844,4,FALSE)","v":"www.nccer.org"}]
[368,"NCCER215","(NCCER215) NCCER Electronic Systems Technician - Level 4 (Postsecondary)","NCCER Electronic Systems Technician - Level 4 (Postsecondary)",1,368,"National Center for Construction Education & Research (NCCER)",{"$f":"VLOOKUP(B369,Certifications!$A$2:$D$844,4,FALSE)","v":"www.nccer.org"}]
[369,"NCCER216","(NCCER216) NCCER Heavy Equipment Operations - Level 1 (Postsecondary)","NCCER Heavy Equipment Operations - Level 1 (Postsecondary)",1,369,"National Center for Construction Education & Research (NCCER)",{"$f":"VLOOKUP(B370,Certifications!$A$2:$D$844,4,FALSE)","v":"www.nccer.org"}]
[370,"NCCER217","(NCCER217) NCCER Heavy Equipment Operations - Level 2 (Postsecondary)","NCCER Heavy Equipment Operations - Level 2 (Postsecondary)",1,370,"National Center for Construction Education & Research (NCCER)",{"$f":"VLOOKUP(B371,Certifications!$A$2:$D$844,4,FALSE)","v":"www.nccer.org"}]
[371,"NCCER218","(NCCER218) NCCER Heavy Equipment Operations - Level 3 (Postsecondary)","NCCER Heavy Equipment Operations - Level 3 (Postsecondary)",1,371,"National Center for Construction Education & Research (NCCER)",{"$f":"VLOOKUP(B372,Certifications!$A$2:$D$844,4,FALSE)","v":"www.nccer.org"}]
[372,"NCCER219","(NCCER219) NCCER HVAC - Level 1 (Postsecondary)","NCCER HVAC - Level 1 (Postsecondary)",1,372,"National Center for Construction Education & Research (NCCER)",{"$f":"VLOOKUP(B373,Certifications!$A$2:$D$844,4,FALSE)","v":"www.nccer.org"}]
[373,"NCCER220","(NCCER220) NCCER HVAC - Level 2 (Postsecondary)","NCCER HVAC - Level 2 (Postsecondary)",1,373,"National Center for Construction Education & Research (NCCER)",{"$f":"VLOOKUP(B374,Certifications!$A$2:$D$844,4,FALSE)","v":"www.nccer.org"}]
[374,"NCCER221","(NCCER221) NCCER HVAC - Level 3 (Postsecondary)","NCCER HVAC - Level 3 (Postsecondary)",1,374,"National Center for Construction Education & Research (NCCER)",{"$f":"VLOOKUP(B375,Certifications!$A$2:$D$844,4,FALSE)","v":"www.nccer.org"}]
[375,"NCCER222","(NCCER222) NCCER HVAC - Level 4 (Postsecondary)","NCCER HVAC - Level 4 (Postsecondary)",2,375,"National Center for Construction Education & Research (NCCER)",{"$f":"VLOOKUP(B376,Certifications!$A$2:$D$844,4,FALSE)","v":"www.nccer.org"}]
[376,"NCCER223","(NCCER223) NCCER Industrial Maintenance Mechanic - Level 1 (Postsecondary)","NCCER Industrial Maintenance Mechanic - Level 1 (Postsecondary)",1,376,"National Center for Construction Education & Research (NCCER)",{"$f":"VLOOKUP(B377,Certifications!$A$2:$D$844,4,FALSE)","v":"www.nccer.org"}]
[377,"NCCER224","(NCCER224) NCCER Industrial Maintenance Mechanic - Level 2 (Postsecondary)","NCCER Industrial Maintenance Mechanic - Level 2 (Postsecondary)",1,377,"National Center for Construction Education & Research (NCCER)",{"$f":"VLOOKUP(B378,Certifications!$A$2:$D$844,4,FALSE)","v":"www.nccer.org"}]
[378,"NCCER225","(NCCER225) NCCER Industrial Maintenance Mechanic - Level 3 (Postsecondary)","NCCER Industrial Maintenance Mechanic - Level 3 (Postsecondary)",1,378,"National Center for Construction Education & Research (NCCER)",{"$f":"VLOOKUP(B379,Certifications!$A$2:$D$844,4,FALSE)","v":"www.nccer.org"}]
[379,"NCCER231","(NCCER231) NCCER Insulating - Level 3 (Postsecondary)","NCCER Insulating - Level 3 (Postsecondary)",1,379,"National Center for Construction Education & Research (NCCER)",{"$f":"VLOOKUP(B380,Certifications!$A$2:$D$844,4,FALSE)","v":"www.nccer.org"}]
[380,"NCCER234","(NCCER234) NCCER Ironworking - Level 3 (Postsecondary)","NCCER Ironworking - Level 3 (Postsecondary)",1,380,"National Center for Construction Education & Research (NCCER)",{"$f":"VLOOKUP(B381,Certifications!$A$2:$D$844,4,FALSE)","v":"www.nccer.org"}]
[381,"NCCER235","(NCCER235) NCCER Masonry - Level 1 (Postsecondary)","NCCER Masonry - Level 1 (Postsecondary)",1,381,"National Center for Construction Education & Research (NCCER)",{"$f":"VLOOKUP(B382,Certifications!$A$2:$D$844,4,FALSE)","v":"www.nccer.org"}]
[382,"NCCER236","(NCCER236) NCCER Masonry - Level 2 (Postsecondary)","NCCER Masonry - Level 2 (Postsecondary)",1,382,"National Center for Construction Education & Research (NCCER)",{"$f":"VLOOKUP(B383,Certifications!$A$2:$D$844,4,FALSE)","v":"www.nccer.org"}]
[383,"NCCER237","(NCCER237) NCCER Masonry - Level 3 (Postsecondary)","NCCER Masonry - Level 3 (Postsecondary)",1,383,"National Center for Construction Education & Research (NCCER)",{"$f":"VLOOKUP(B384,Certifications!$A$2:$D$844,4,FALSE)","v":"www.nccer.org"}]
[384,"NCCER238","(NCCER238) NCCER Millwright - Level 1 (Postsecondary)","NCCER Millwright - Level 1 (Postsecondary)",1,384,"National Center for Construction Education & Research (NCCER)",{"$f":"VLOOKUP(B385,Certifications!$A$2:$D$844,4,FALSE)","v":"www.nccer.org"}]
[385,"NCCER239","(NCCER239) NCCER Millwright - Level 2 (Postsecondary)","NCCER Millwright - Level 2 (Postsecondary)",1,385,"National Center for Construction Education & Research (NCCER)",{"$f":"VLOOKUP(B386,Certifications!$A$2:$D$844,4,FALSE)","v":"www.nccer.org"}]
[386,"NCCER240","(NCCER240) NCCER Millwright - Level 3 (Postsecondary)","NCCER Millwright - Level 3 (Postsecondary)",1,386,"National Center for Construction Education & Research (NCCER)",{"$f":"VLOOKUP(B387,Certifications!$A$2:$D$844,4,FALSE)","v":"www.nccer.org"}]
[387,"NCCER241","(NCCER241) NCCER Millwright - Level 4 (Postsecondary)","NCCER Millwright - Level 4 (Postsecondary)",1,387,"National Center for Construction Education & Research (NCCER)",{"$f":"VLOOKUP(B388,Certifications!$A$2:$D$844,4,FALSE)","v":"www.nccer.org"}]
[388,"NCCER242","(NCCER242) NCCER Millwright - Level 5 (Postsecondary)","NCCER Millwright - Level 5 (Postsecondary)",1,388,"National Center for Construction Education & Research (NCCER)",{"$f":"VLOOKUP(B389,Certifications!$A$2:$D$844,4,FALSE)","v":"www.nccer.org"}]
[389,"NCCER243","(NCCER243) NCCER Painting - Level 1 (Postsecondary)","NCCER Painting - Level 1 (Postsecondary)",1,389,"National Center for Construction Education & Research (NCCER)",{"$f":"VLOOKUP(B390,Certifications!$A$2:$D$844,4,FALSE)","v":"www.nccer.org"}]
[390,"NCCER244","(NCCER244) NCCER Painting - Level 2 (Postsecondary)","NCCER Painting - Level 2 (Postsecondary)",1,390,"National Center for Construction Education & Research (NCCER)",{"$f":"VLOOKUP(B391,Certifications!$A$2:$D$844,4,FALSE)","v":"www.nccer.org"}]
[391,"NCCER245","(NCCER245) NCCER Painting - Level 3 (Postsecondary)","NCCER Painting - Level 3 (Postsecondary)",1,391,"National Center for Construction Education & Research (NCCER)",{"$f":"VLOOKUP(B392,Certifications!$A$2:$D$844,4,FALSE)","v":"www.nccer.org"}]
[392,"NCCER249","(NCCER249) NCCER Pipefitting - Level 4 (Postsecondary)","NCCER Pipefitting - Level 4 (Postsecondary)",5,392,"National Center for Construction Education & Research (NCCER)",{"$f":"VLOOKUP(B393,Certifications!$A$2:$D$844,4,FALSE)","v":"www.nccer.org"}]
[393,"NCCER250","(NCCER250) NCCER Plumbing - Level 1 (Postsecondary)","NCCER Plumbing - Level 1 (Postsecondary)",1,393,"National Center for Construction Education & Research (NCCER)",{"$f":"VLOOKUP(B394,Certifications!$A$2:$D$844,4,FALSE)","v":"www.nccer.org"}]
[394,"NCCER251","(NCCER251) NCCER Plumbing - Level 2 (Postsecondary)","NCCER Plumbing - Level 2 (Postsecondary)",1,394,"National Center for Construction Education & Research (NCCER)",{"$f":"VLOOKUP(B395,Certifications!$A$2:$D$844,4,FALSE)","v":"www.nccer.org"}]
[395,"NCCER252","(NCCER252) NCCER Plumbing - Level 3 (Postsecondary)","NCCER Plumbing - Level 3 (Postsecondary)",1,395,"National Center for Construction Education & Research (NCCER)",{"$f":"VLOOKUP(B396,Certifications!$A$2:$D$844,4,FALSE)","v":"www.nccer.org"}]
[396,"NCCER253","(NCCER253) NCCER Plumbing - Level 4 (Postsecondary)","NCCER Plumbing - Level 4 (Postsecondary)",5,396,"National Center for Construction Education & Research (NCCER)",{"$f":"VLOOKUP(B397,Certifications!$A$2:$D$844,4,FALSE)","v":"www.nccer.org"}]
[397,"NCCER254","(NCCER254) NCCER Project Management (Postsecondary)","NCCER Project Management (Postsecondary)",1,397,"National Center for Construction Education & Research (NCCER)",{"$f":"VLOOKUP(B398,Certifications!$A$2:$D$844,4,FALSE)","v":"www.nccer.org"}]
[398,"NCCER255","(NCCER255) NCCER Sheet Metal - Level 1 (Postsecondary)","NCCER Sheet Metal - Level 1 (Postsecondary)",1,398,"National Center for Construction Education & Research (NCCER)",{"$f":"VLOOKUP(B399,Certifications!$A$2:$D$844,4,FALSE)","v":"www.nccer.org"}]
[399,"NCCER258","(NCCER258) NCCER Sheet Metal - Level 4 (Postsecondary)","NCCER Sheet Metal - Level 4 (Postsecondary)",1,399,"National Center for Construction Education & Research (NCCER)",{"$f":"VLOOKUP(B400,Certifications!$A$2:$D$844,4,FALSE)","v":"www.nccer.org"}]
[400,"NCCER262","(NCCER262) NCCER Sprinkler Fitting Level 4 (Postsecondary)","NCCER Sprinkler Fitting Level 4 (Postsecondary)",1,400,"National Center for Construction Education & Research (NCCER)",{"$f":"VLOOKUP(B401,Certifications!$A$2:$D$844,4,FALSE)","v":"www.nccer.org"}]
[401,"NCCER263","(NCCER263) NCCER Welding - Level 1 (Postsecondary)","NCCER Welding - Level 1 (Postsecondary)",1,401,"National Center for Construction Education & Research (NCCER)",{"$f":"VLOOKUP(B402,Certifications!$A$2:$D$844,4,FALSE)","v":"www.nccer.org"}]
[402,"NCCER264","(NCCER264) NCCER Welding - Level 2 (Postsecondary)","NCCER Welding - Level 2 (Postsecondary)",1,402,"National Center for Construction Education & Research (NCCER)",{"$f":"VLOOKUP(B403,Certifications!$A$2:$D$844,4,FALSE)","v":"www.nccer.org"}]
[403,"NCCER265","(NCCER265) NCCER Welding - Level 3 (Postsecondary)","NCCER Welding - Level 3 (Postsecondary)",2,403,"National Center for Construction Education & Research (NCCER)",{"$f":"VLOOKUP(B404,Certifications!$A$2:$D$844,4,FALSE)","v":"www.nccer.org"}]
[404,"NCCER266","(NCCER266) NCCER Industrial Maintenance Mechanic - Level 4 (Postsecondary)","NCCER Industrial Maintenance Mechanic - Level 4 (Postsecondary)",1,404,"National Center for Construction Education & Research (NCCER)",{"$f":"VLOOKUP(B405,Certifications!$A$2:$D$844,4,FALSE)","v":"www.nccer.org"}]
[405,"NCCER267","(NCCER267) NCCER Industrial Maintenance, Electrical & Instrumentation Technician - Level 4 (Postsecondary)","NCCER Industrial Maintenance, Electrical & Instrumentation Technician - Level 4 (Postsecondary)",2,405,"National Center for Construction Education & Research (NCCER)",{"$f":"VLOOKUP(B406,Certifications!$A$2:$D$844,4,FALSE)","v":"www.nccer.org"}]
[406,"NCDLT001","(NCDLT001) Certified Dental Technician","Certified Dental Technician",1,406,"National Board for Certification in Dental Laboratory Technology",{"$f":"VLOOKUP(B407,Certifications!$A$2:$D$844,4,FALSE)","v":"www.nbccert.org/"}]
[407,"NCFCT001","(NCFCT001) Certified ECG Technician","Certified ECG Technician",1,407,"National Center for Competency Testing",{"$f":"VLOOKUP(B408,Certifications!$A$2:$D$844,4,FALSE)","v":"www.ncctinc.com"}]
[408,"NCFCT003","(NCFCT003) Certified Phlebotomy Technician","Certified Phlebotomy Technician",1,408,"National Center for Competency Testing",{"$f":"VLOOKUP(B409,Certifications!$A$2:$D$844,4,FALSE)","v":"www.ncctinc.com"}]
[409,"NCFCT004","(NCFCT004) Tech in Surgery - Certified (NCCT)","Tech in Surgery - Certified (NCCT)",5,409,"National Center for Competency Testing",{"$f":"VLOOKUP(B410,Certifications!$A$2:$D$844,4,FALSE)","v":"www.ncctinc.com"}]
[410,"NCFCT005","(NCFCT005) Medical Assistant","Medical Assistant",5,410,"National Center for Competency Testing",{"$f":"VLOOKUP(B411,Certifications!$A$2:$D$844,4,FALSE)","v":"www.ncctinc.com"}]
[411,"NCFCT006","(NCFCT006) National Certified Insurance and Coding Specialist (NCICS)","National Certified Insurance and Coding Specialist (NCICS)",1,411,"National Center for Competency Testing (NCCT)",{"$f":"VLOOKUP(B412,Certifications!$A$2:$D$844,4,FALSE)","v":"www.ncctinc.com"}]
[412,"NCFCT007","(NCFCT007) National Certified Medical Office Assistant (NCMOA)","National Certified Medical Office Assistant (NCMOA)",1,412,"National Center for Competency Testing (NCCT)",{"$f":"VLOOKUP(B413,Certifications!$A$2:$D$844,4,FALSE)","v":"www.ncctinc.com"}]
[413,"NCFCT008","(NCFCT008) National Certified Patient Care Technician (NCPCT)","National Certified Patient Care Technician (NCPCT)",1,413,"National Center for Competency Testing (NCCT)",{"$f":"VLOOKUP(B414,Certifications!$A$2:$D$844,4,FALSE)","v":"www.ncctinc.com"}]
[414,"NCMCA001","(NCMCA001) Certified Board for Sterile Processing and Distribution","Certified Board for Sterile Processing and Distribution",1,414,"National Commission for Certifying Agencies",{"$f":"VLOOKUP(B415,Certifications!$A$2:$D$844,4,FALSE)","v":"www.sterileprocessing.org/technician.htm"}]
[415,"NCRAS001","(NCRAS001) Certified Broadcast Captioner","Certified Broadcast Captioner",1,415,"National Court Reporters Association",{"$f":"VLOOKUP(B416,Certifications!$A$2:$D$844,4,FALSE)","v":"www.ncra.org/"}]
[416,"NCRAS003","(NCRAS003) Professional Reporter","Professional Reporter",1,416,"National Court Reporters Association",{"$f":"VLOOKUP(B417,Certifications!$A$2:$D$844,4,FALSE)","v":"www.ncra.org/"}]
[417,"NCSAF001","(NCSAF001) Certified Strength Coach","Certified Strength Coach",4,417,"National Council on Strength and Fitness (NCSF)",{"$f":"VLOOKUP(B418,Certifications!$A$2:$D$844,4,FALSE)","v":"www.ncsf.org"}]
[418,"NCSAF002","(NCSAF002) Certified Personal Trainer","Certified Personal Trainer",4,418,"National Council on Strength and Fitness (NCSF)",{"$f":"VLOOKUP(B419,Certifications!$A$2:$D$844,4,FALSE)","v":"www.ncsf.org"}]
[419,"NCSAF003","(NCSAF003) Sport Nutrition Specialist","Sport Nutrition Specialist",4,419,"National Council on Strength and Fitness (NCSF)",{"$f":"VLOOKUP(B420,Certifications!$A$2:$D$844,4,FALSE)","v":"www.ncsf.org"}]
[420,"NCSBN001","(NCSBN001) National Licensed Registered Nurse (NCLEX-RN)","National Licensed Registered Nurse (NCLEX-RN)",4,420,"National Council of State Boards of Nursing",{"$f":"VLOOKUP(B421,Certifications!$A$2:$D$844,4,FALSE)","v":"www.ncsbn.org/"}]
[421,"NCSBN002","(NCSBN002) National Licensed Practical Nurse (NCLEX-PN)","National Licensed Practical Nurse (NCLEX-PN)",2,421,"National Council of State Boards of Nursing",{"$f":"VLOOKUP(B422,Certifications!$A$2:$D$844,4,FALSE)","v":"www.ncsbn.org/"}]
[422,"NIASE001","(NIASE001) ASE - Advanced Engine Performance Specialist (L1)","ASE - Advanced Engine Performance Specialist (L1)",2,422,"National Institute for Automotive Service Excellence",{"$f":"VLOOKUP(B423,Certifications!$A$2:$D$844,4,FALSE)","v":"www.ase.com"}]
[423,"NIASE002","(NIASE002) ASE Master Automobile Technician","ASE Master Automobile Technician",1,423,"National Institute for Automotive Service Excellence",{"$f":"VLOOKUP(B424,Certifications!$A$2:$D$844,4,FALSE)","v":"www.ase.com"}]
[424,"NIASE005","(NIASE005) ASE Automobile/Light Truck Technician: Automatic Transmission/Transaxle (A2)","ASE Automobile/Light Truck Technician: Automatic Transmission/Transaxle (A2)",2,424,"National Institute for Automotive Service Excellence",{"$f":"VLOOKUP(B425,Certifications!$A$2:$D$844,4,FALSE)","v":"www.ase.com"}]
[425,"NIASE007","(NIASE007) ASE Automobile/Light Truck Technician: Brakes (A5)","ASE Automobile/Light Truck Technician: Brakes (A5)",2,425,"National Institute for Automotive Service Excellence",{"$f":"VLOOKUP(B426,Certifications!$A$2:$D$844,4,FALSE)","v":"www.ase.com"}]
[426,"NIASE008","(NIASE008) ASE Automobile/Light Truck Technician: Electrical/Electronic Systems (A6)","ASE Automobile/Light Truck Technician: Electrical/Electronic Systems (A6)",2,426,"National Institute for Automotive Service Excellence",{"$f":"VLOOKUP(B427,Certifications!$A$2:$D$844,4,FALSE)","v":"www.ase.com"}]
[427,"NIASE009","(NIASE009) ASE Automobile/Light Truck Technician: Engine Performance (A8)","ASE Automobile/Light Truck Technician: Engine Performance (A8)",2,427,"National Institute for Automotive Service Excellence",{"$f":"VLOOKUP(B428,Certifications!$A$2:$D$844,4,FALSE)","v":"www.ase.com"}]
[428,"NIASE010","(NIASE010) ASE Automobile/Light Truck Technician: Engine Repair (A1)","ASE Automobile/Light Truck Technician: Engine Repair (A1)",2,428,"National Institute for Automotive Service Excellence",{"$f":"VLOOKUP(B429,Certifications!$A$2:$D$844,4,FALSE)","v":"www.ase.com"}]
[429,"NIASE011","(NIASE011) ASE Automobile/Light Truck Technician: Heating and Air Conditioning (A7)","ASE Automobile/Light Truck Technician: Heating and Air Conditioning (A7)",2,429,"National Institute for Automotive Service Excellence",{"$f":"VLOOKUP(B430,Certifications!$A$2:$D$844,4,FALSE)","v":"www.ase.com"}]
[430,"NIASE012","(NIASE012) ASE Automobile/Light Truck Technician: Manual Drive Train and Axles (A3)","ASE Automobile/Light Truck Technician: Manual Drive Train and Axles (A3)",2,430,"National Institute for Automotive Service Excellence",{"$f":"VLOOKUP(B431,Certifications!$A$2:$D$844,4,FALSE)","v":"www.ase.com"}]
[431,"NIASE013","(NIASE013) ASE Automobile Service Consultant (C1)","ASE Automobile Service Consultant (C1)",1,431,"National Institute for Automotive Service Excellence",{"$f":"VLOOKUP(B432,Certifications!$A$2:$D$844,4,FALSE)","v":"www.ase.com"}]
[432,"NIASE014","(NIASE014) ASE Automobile/Light Truck Technician: Suspension and Steering (A4)","ASE Automobile/Light Truck Technician: Suspension and Steering (A4)",2,432,"National Institute for Automotive Service Excellence",{"$f":"VLOOKUP(B433,Certifications!$A$2:$D$844,4,FALSE)","v":"www.ase.com"}]
[433,"NIASE016","(NIASE016) ASE Medium/Heavy Truck Technician: Brakes (T4)","ASE Medium/Heavy Truck Technician: Brakes (T4)",5,433,"National Institute for Automotive Service Excellence",{"$f":"VLOOKUP(B434,Certifications!$A$2:$D$844,4,FALSE)","v":"www.ase.com"}]
[434,"NIASE017","(NIASE017) ASE Collision Repair and Refinishing Technician: Mechanical and Electrical Components (B5)","ASE Collision Repair and Refinishing Technician: Mechanical and Electrical Components (B5)",2,434,"National Institute for Automotive Service Excellence",{"$f":"VLOOKUP(B435,Certifications!$A$2:$D$844,4,FALSE)","v":"www.ase.com"}]
[435,"NIASE018","(NIASE018) ASE Collision Repair and Refinishing Technician: Non-structural Analysis and Damage Repair (B3)","ASE Collision Repair and Refinishing Technician: Non-structural Analysis and Damage Repair (B3)",2,435,"National Institute for Automotive Service Excellence",{"$f":"VLOOKUP(B436,Certifications!$A$2:$D$844,4,FALSE)","v":"www.ase.com"}]
[436,"NIASE019","(NIASE019) ASE - Damage Analysis and Estimating (B6)","ASE - Damage Analysis and Estimating (B6)",1,436,"National Institute for Automotive Service Excellence",{"$f":"VLOOKUP(B437,Certifications!$A$2:$D$844,4,FALSE)","v":"www.ase.com"}]
[437,"NIASE020","(NIASE020) ASE Medium/Heavy Truck Technician: Diesel Engines (T2)","ASE Medium/Heavy Truck Technician: Diesel Engines (T2)",5,437,"National Institute for Automotive Service Excellence",{"$f":"VLOOKUP(B438,Certifications!$A$2:$D$844,4,FALSE)","v":"www.ase.com"}]
[438,"NIASE021","(NIASE021) ASE Medium/Heavy Truck Technician: Drive Train (T3)","ASE Medium/Heavy Truck Technician: Drive Train (T3)",5,438,"National Institute for Automotive Service Excellence",{"$f":"VLOOKUP(B439,Certifications!$A$2:$D$844,4,FALSE)","v":"www.ase.com"}]
[439,"NIASE023","(NIASE023) ASE Medium/Heavy Truck Technician: Electrical/Electronic Systems (T6)","ASE Medium/Heavy Truck Technician: Electrical/Electronic Systems (T6)",5,439,"National Institute for Automotive Service Excellence",{"$f":"VLOOKUP(B440,Certifications!$A$2:$D$844,4,FALSE)","v":"www.ase.com"}]
[440,"NIASE025","(NIASE025) ASE - Gasoline Engines (T1)","ASE - Gasoline Engines (T1)",5,440,"National Institute for Automotive Service Excellence",{"$f":"VLOOKUP(B441,Certifications!$A$2:$D$844,4,FALSE)","v":"www.ase.com"}]
[441,"NIASE026","(NIASE026) ASE Medium/Heavy Truck Technician: Heating, Ventilation, and A/C (HVAC) (T7)","ASE Medium/Heavy Truck Technician: Heating, Ventilation, and A/C (HVAC) (T7)",5,441,"National Institute for Automotive Service Excellence",{"$f":"VLOOKUP(B442,Certifications!$A$2:$D$844,4,FALSE)","v":"www.ase.com"}]
[442,"NIASE029","(NIASE029) ASE Collision Repair and Refinishing Technician: Painting and Refinishing (B2)","ASE Collision Repair and Refinishing Technician: Painting and Refinishing (B2)",2,442,"National Institute for Automotive Service Excellence",{"$f":"VLOOKUP(B443,Certifications!$A$2:$D$844,4,FALSE)","v":"www.ase.com"}]
[443,"NIASE031","(NIASE031) ASE Medium/Heavy Truck Technician: Preventive Maintenance Inspection (PMI) (T8)","ASE Medium/Heavy Truck Technician: Preventive Maintenance Inspection (PMI) (T8)",5,443,"National Institute for Automotive Service Excellence",{"$f":"VLOOKUP(B444,Certifications!$A$2:$D$844,4,FALSE)","v":"www.ase.com"}]
[444,"NIASE032","(NIASE032) ASE Collision Repair and Refinishing Technician: Structural Analysis and Damage Repair (B4)","ASE Collision Repair and Refinishing Technician: Structural Analysis and Damage Repair (B4)",2,444,"National Institute for Automotive Service Excellence",{"$f":"VLOOKUP(B445,Certifications!$A$2:$D$844,4,FALSE)","v":"www.ase.com"}]
[445,"NIASE033","(NIASE033) ASE Medium/Heavy Truck Technician: Suspension and Steering (T5)","ASE Medium/Heavy Truck Technician: Suspension and Steering (T5)",5,445,"National Institute for Automotive Service Excellence",{"$f":"VLOOKUP(B446,Certifications!$A$2:$D$844,4,FALSE)","v":"www.ase.com"}]
[446,"NIASE035","(NIASE035) ASE Master Collision Repair and Refinishing Technician","ASE Master Collision Repair and Refinishing Technician",1,446,"National Institute for Automotive Service Excellence",{"$f":"VLOOKUP(B447,Certifications!$A$2:$D$844,4,FALSE)","v":"www.ase.com"}]
[447,"NIASE053","(NIASE053) ASE - Compressed Natural Gas (CNG) Engines (H1)","ASE - Compressed Natural Gas (CNG) Engines (H1)",5,447,"National Institute for Automotive Service Excellence",{"$f":"VLOOKUP(B448,Certifications!$A$2:$D$844,4,FALSE)","v":"www.ase.com"}]
[448,"NIASE054","(NIASE054) ASE - Diesel Engines (H2)","ASE - Diesel Engines (H2)",5,448,"National Institute for Automotive Service Excellence",{"$f":"VLOOKUP(B449,Certifications!$A$2:$D$844,4,FALSE)","v":"www.ase.com"}]
[449,"NIASE055","(NIASE055) ASE - Drive Train (H3)","ASE - Drive Train (H3)",5,449,"National Institute for Automotive Service Excellence",{"$f":"VLOOKUP(B450,Certifications!$A$2:$D$844,4,FALSE)","v":"www.ase.com"}]
[450,"NIASE056","(NIASE056) ASE - Brakes (H4)","ASE - Brakes (H4)",5,450,"National Institute for Automotive Service Excellence",{"$f":"VLOOKUP(B451,Certifications!$A$2:$D$844,4,FALSE)","v":"www.ase.com"}]
[451,"NIASE057","(NIASE057) ASE - Suspension and Steering (H5)","ASE - Suspension and Steering (H5)",5,451,"National Institute for Automotive Service Excellence",{"$f":"VLOOKUP(B452,Certifications!$A$2:$D$844,4,FALSE)","v":"www.ase.com"}]
[452,"NIASE058","(NIASE058) ASE - Electrical/Electronic Systems (H6)","ASE - Electrical/Electronic Systems (H6)",5,452,"National Institute for Automotive Service Excellence",{"$f":"VLOOKUP(B453,Certifications!$A$2:$D$844,4,FALSE)","v":"www.ase.com"}]
[453,"NIASE059","(NIASE059) ASE - Heating Ventilation and Air Conditioning (HVAC) (H7)","ASE - Heating Ventilation and Air Conditioning (HVAC) (H7)",5,453,"National Institute for Automotive Service Excellence",{"$f":"VLOOKUP(B454,Certifications!$A$2:$D$844,4,FALSE)","v":"www.ase.com"}]
[454,"NIASE060","(NIASE060) ASE - Preventive Maintenance and Inspection (PMI) (H8)","ASE - Preventive Maintenance and Inspection (PMI) (H8)",5,454,"National Institute for Automotive Service Excellence",{"$f":"VLOOKUP(B455,Certifications!$A$2:$D$844,4,FALSE)","v":"www.ase.com"}]
[455,"NIASE061","(NIASE061) ASE - Alternate Fuels (F1)","ASE - Alternate Fuels (F1)",2,455,"National Institute for Automotive Service Excellence",{"$f":"VLOOKUP(B456,Certifications!$A$2:$D$844,4,FALSE)","v":"www.ase.com"}]
[456,"NIASE071","(NIASE071) ASE - Light Vehicle Diesel Engines (A9)","ASE - Light Vehicle Diesel Engines (A9)",2,456,"National Institute for Automotive Service Excellence",{"$f":"VLOOKUP(B457,Certifications!$A$2:$D$844,4,FALSE)","v":"www.ase.com"}]
[457,"NIASE076","(NIASE076) ASE Auto Maintenance and Light Repair (G1)","ASE Auto Maintenance and Light Repair (G1)",1,457,"National Institute for Automotive Service Excellence",{"$f":"VLOOKUP(B458,Certifications!$A$2:$D$844,4,FALSE)","v":"www.ase.com"}]
[458,"NIASE094","(NIASE094) ASE Entry-level - Truck: Inspection, Maintenance, and Minor Repair (IM)","ASE Entry-level - Truck: Inspection, Maintenance, and Minor Repair (IM)",1,458,"National Institute for Automotive Service Excellence",{"$f":"VLOOKUP(B459,Certifications!$A$2:$D$844,4,FALSE)","v":"www.ase.com"}]
[459,"NIFMS001","(NIFMS001) NIMS Machining Level I - CNC Milling: Programming Setup & Operations","NIMS Machining Level I - CNC Milling: Programming Setup & Operations",1,459,"National Institute for Metalworking Skills (NIMS)",{"$f":"VLOOKUP(B460,Certifications!$A$2:$D$844,4,FALSE)","v":"www.nims-skills.org"}]
[460,"NIFMS002","(NIFMS002) NIMS Machining Level I - CNC Turning: Programming Setup & Operations","NIMS Machining Level I - CNC Turning: Programming Setup & Operations",1,460,"National Institute for Metalworking Skills (NIMS)",{"$f":"VLOOKUP(B461,Certifications!$A$2:$D$844,4,FALSE)","v":"www.nims-skills.org"}]
[461,"NIFMS003","(NIFMS003) NIMS Machining Level II - EDM - Plunge","NIMS Machining Level II - EDM - Plunge",2,461,"National Institute for Metalworking Skills (NIMS)",{"$f":"VLOOKUP(B462,Certifications!$A$2:$D$844,4,FALSE)","v":"www.nims-skills.org"}]
[462,"NIFMS004","(NIFMS004) NIMS Machining Level II - EDM - Wire","NIMS Machining Level II - EDM - Wire",2,462,"National Institute for Metalworking Skills (NIMS)",{"$f":"VLOOKUP(B463,Certifications!$A$2:$D$844,4,FALSE)","v":"www.nims-skills.org"}]
[463,"NIFMS007","(NIFMS007) NIMS Machining Level II - Manual Milling Skills II","NIMS Machining Level II - Manual Milling Skills II",2,463,"National Institute for Metalworking Skills (NIMS)",{"$f":"VLOOKUP(B464,Certifications!$A$2:$D$844,4,FALSE)","v":"www.nims-skills.org"}]
[464,"NIFMS008","(NIFMS008) NIMS Machining Level I - Turning Operations: Turning Between Centers","NIMS Machining Level I - Turning Operations: Turning Between Centers",1,464,"National Institute for Metalworking Skills (NIMS)",{"$f":"VLOOKUP(B465,Certifications!$A$2:$D$844,4,FALSE)","v":"www.nims-skills.org"}]
[465,"NIFMS010","(NIFMS010) NIMS Machining Level I - Turning Operations: Turning Chucking Skills","NIMS Machining Level I - Turning Operations: Turning Chucking Skills",1,465,"National Institute for Metalworking Skills (NIMS)",{"$f":"VLOOKUP(B466,Certifications!$A$2:$D$844,4,FALSE)","v":"www.nims-skills.org"}]
[466,"NIFMS012","(NIFMS012) NIMS Machining Level II - Grinding Skills II","NIMS Machining Level II - Grinding Skills II",2,466,"National Institute for Metalworking Skills (NIMS)",{"$f":"VLOOKUP(B467,Certifications!$A$2:$D$844,4,FALSE)","v":"www.nims-skills.org"}]
[467,"NIFMS013","(NIFMS013) NIMS Machining Level I - Drill Press Skills I","NIMS Machining Level I - Drill Press Skills I",1,467,"National Institute for Metalworking Skills (NIMS)",{"$f":"VLOOKUP(B468,Certifications!$A$2:$D$844,4,FALSE)","v":"www.nims-skills.org"}]
[468,"NIFMS014","(NIFMS014) NIMS Machining Level I - CNC Milling: Operations","NIMS Machining Level I - CNC Milling: Operations",1,468,"National Institute for Metalworking Skills (NIMS)",{"$f":"VLOOKUP(B469,Certifications!$A$2:$D$844,4,FALSE)","v":"www.nims-skills.org"}]
[469,"NIFMS015","(NIFMS015) NIMS Machining Level I - CNC Turning: Operations","NIMS Machining Level I - CNC Turning: Operations",1,469,"National Institute for Metalworking Skills (NIMS)",{"$f":"VLOOKUP(B470,Certifications!$A$2:$D$844,4,FALSE)","v":"www.nims-skills.org"}]
[470,"NIFMS016","(NIFMS016) NIMS Machining Level I - Grinding Skills I","NIMS Machining Level I - Grinding Skills I",1,470,"National Institute for Metalworking Skills (NIMS)",{"$f":"VLOOKUP(B471,Certifications!$A$2:$D$844,4,FALSE)","v":"www.nims-skills.org"}]
[471,"NIFMS017","(NIFMS017) NIMS Machining Level I - Manual Milling Skills I","NIMS Machining Level I - Manual Milling Skills I",1,471,"National Institute for Metalworking Skills (NIMS)",{"$f":"VLOOKUP(B472,Certifications!$A$2:$D$844,4,FALSE)","v":"www.nims-skills.org"}]
[472,"NIFMS018","(NIFMS018) NIMS Machining Level II - Drill Press Skills II","NIMS Machining Level II - Drill Press Skills II",2,472,"National Institute for Metalworking Skills (NIMS)",{"$f":"VLOOKUP(B473,Certifications!$A$2:$D$844,4,FALSE)","v":"www.nims-skills.org"}]
[473,"NIFMS019","(NIFMS019) NIMS Machining Level II - CNC Milling Skills II","NIMS Machining Level II - CNC Milling Skills II",2,473,"National Institute for Metalworking Skills (NIMS)",{"$f":"VLOOKUP(B474,Certifications!$A$2:$D$844,4,FALSE)","v":"www.nims-skills.org"}]
[474,"NIFMS020","(NIFMS020) NIMS Machining Level II - CNC Turning Skills II","NIMS Machining Level II - CNC Turning Skills II",2,474,"National Institute for Metalworking Skills (NIMS)",{"$f":"VLOOKUP(B475,Certifications!$A$2:$D$844,4,FALSE)","v":"www.nims-skills.org"}]
[475,"NIFMS021","(NIFMS021) NIMS Industrial Technology Maintenance Level 1 Bundle (9 Exams)","NIMS Industrial Technology Maintenance Level 1 Bundle (9 Exams)",2,475,"National Institute for Metalworking Skills",{"$f":"VLOOKUP(B476,Certifications!$A$2:$D$844,4,FALSE)","v":"www.nims-skills.org"}]
[476,"NJATC001","(NJATC001) NJATC Electrical - Level 5","NJATC Electrical - Level 5",2,476,"National Joint Apprenticeship and Training Committee",{"$f":"VLOOKUP(B477,Certifications!$A$2:$D$844,4,FALSE)","v":"www.njatc.org"}]
[477,"NMTCB001","(NMTCB001) Certified Nuclear Medicine Technologist","Certified Nuclear Medicine Technologist",4,477,"Nuclear Medicine Technology Certification Board",{"$f":"VLOOKUP(B478,Certifications!$A$2:$D$844,4,FALSE)","v":"www.nmtcb.org/"}]
[478,"NMTCB002","(NMTCB002) Computed Tomography (CT)","Computed Tomography (CT)",4,478,"Nuclear Medicine Technology Certification Board",{"$f":"VLOOKUP(B479,Certifications!$A$2:$D$844,4,FALSE)","v":"www.nmtcb.org/"}]
[479,"NNCCO001","(NNCCO001) Certified Clinical Hemodialysis Technician","Certified Clinical Hemodialysis Technician",2,479,"Nephrology Nursing Certification Commission",{"$f":"VLOOKUP(B480,Certifications!$A$2:$D$844,4,FALSE)","v":"www.nncc-exam.org/"}]
[480,"NOCTI003","(NOCTI003) NOCTI Apparel and Textile Production and Merchandising","NOCTI Apparel and Textile Production and Merchandising",1,480,"National Occupational Competency Testing Institute (NOCTI)",{"$f":"VLOOKUP(B481,Certifications!$A$2:$D$844,4,FALSE)","v":"www.nocti.org/"}]
[481,"NOCTI010","(NOCTI010) NOCTI Criminal Justice","NOCTI Criminal Justice",1,481,"National Occupational Competency Testing Institute (NOCTI)",{"$f":"VLOOKUP(B482,Certifications!$A$2:$D$844,4,FALSE)","v":"www.nocti.org/"}]
[482,"NOCTI013","(NOCTI013) NOCTI Television Production","NOCTI Television Production",1,482,"National Occupational Competency Testing Institute (NOCTI)",{"$f":"VLOOKUP(B483,Certifications!$A$2:$D$844,4,FALSE)","v":"www.nocti.org/"}]
[483,"NOCTI015","(NOCTI015) NOCTI Accounting Basic","NOCTI Accounting Basic",1,483,"National Occupational Competency Testing Institute (NOCTI)",{"$f":"VLOOKUP(B484,Certifications!$A$2:$D$844,4,FALSE)","v":"www.nocti.org/"}]
[484,"NOCTI019","(NOCTI019) NOCTI Cabinetmaking","NOCTI Cabinetmaking",1,484,"National Occupational Competency Testing Institute (NOCTI)",{"$f":"VLOOKUP(B485,Certifications!$A$2:$D$844,4,FALSE)","v":"www.nocti.org/"}]
[485,"NRAEF001","(NRAEF001) Foodservice Management Professional (FMP)","Foodservice Management Professional (FMP)",1,485,"National Restaurant Association Educational Foundation",{"$f":"VLOOKUP(B486,Certifications!$A$2:$D$844,4,FALSE)","v":"www.nraef.org"}]
[486,"NRAEF002","(NRAEF002) National ProStart Certificate of Achievement","National ProStart Certificate of Achievement",1,486,"National Restaurant Association Educational Foundation",{"$f":"VLOOKUP(B487,Certifications!$A$2:$D$844,4,FALSE)","v":"www.nraef.org"}]
[487,"NRAEF003","(NRAEF003) Certified Food Protection Manager (ServSafe®)","Certified Food Protection Manager (ServSafe®)",1,487,"National Restaurant Association Educational Foundation",{"$f":"VLOOKUP(B488,Certifications!$A$2:$D$844,4,FALSE)","v":"www.nraef.org"}]
[488,"NREMT001","(NREMT001) Emergency Medical Technician (EMT)","Emergency Medical Technician (EMT)",2,488,"National Registry of Emergency Medical Technicians",{"$f":"VLOOKUP(B489,Certifications!$A$2:$D$844,4,FALSE)","v":"www.nremt.org"}]
[489,"NREMT004","(NREMT004) Paramedic (EMT-P)","Paramedic (EMT-P)",1,489,"National Registry of Emergency Medical Technicians",{"$f":"VLOOKUP(B490,Certifications!$A$2:$D$844,4,FALSE)","v":"www.nremt.org"}]
[490,"NRFSP001","(NRFSP001) Certified Food Safety Manager","Certified Food Safety Manager",1,490,"National Registry of Food Safety Professionals",{"$f":"VLOOKUP(B491,Certifications!$A$2:$D$844,4,FALSE)","v":"www.nrfsp.com/"}]
[491,"NRFSP002","(NRFSP002) HACCP Certification","HACCP Certification",1,491,"National Registry of Food Safety Professionals",{"$f":"VLOOKUP(B492,Certifications!$A$2:$D$844,4,FALSE)","v":"www.nrfsp.com/"}]
[492,"NSTSA001","(NSTSA001) Certified Surgical Technologist (CST)","Certified Surgical Technologist (CST)",2,492,"National Board of Surgical Technologist and Surgical Assisting",{"$f":"VLOOKUP(B493,Certifications!$A$2:$D$844,4,FALSE)","v":"nbstsa.org/"}]
[493,"NSTSA002","(NSTSA002) Certified Surgical First Assistant (CSFA)","Certified Surgical First Assistant (CSFA)",4,493,"National Board of Surgical Technologist and Surgical Assisting",{"$f":"VLOOKUP(B494,Certifications!$A$2:$D$844,4,FALSE)","v":"nbstsa.org/"}]
[494,"ORACL001","(ORACL001) Oracle Certified Associate (OCA): Database","Oracle Certified Associate (OCA): Database",2,494,"Oracle Corporation",{"$f":"VLOOKUP(B495,Certifications!$A$2:$D$844,4,FALSE)","v":"www.oracle.com"}]
[495,"ORACL002","(ORACL002) Oracle Certified Professional (OCP): Database","Oracle Certified Professional (OCP): Database",2,495,"Oracle Corporation",{"$f":"VLOOKUP(B496,Certifications!$A$2:$D$844,4,FALSE)","v":"www.oracle.com"}]
[496,"ORACL003","(ORACL003) Oracle Certified Master (OCM): Database","Oracle Certified Master (OCM): Database",2,496,"Oracle Corporation",{"$f":"VLOOKUP(B497,Certifications!$A$2:$D$844,4,FALSE)","v":"www.oracle.com"}]
[497,"ORACL004","(ORACL004) Oracle Certified Associate (OCA): Java Programmer","Oracle Certified Associate (OCA): Java Programmer",2,497,"Oracle Corporation",{"$f":"VLOOKUP(B498,Certifications!$A$2:$D$844,4,FALSE)","v":"www.oracle.com"}]
[498,"ORACL005","(ORACL005) Oracle Certified Professional (OCP): Java Programmer","Oracle Certified Professional (OCP): Java Programmer",2,498,"Oracle Corporation",{"$f":"VLOOKUP(B499,Certifications!$A$2:$D$844,4,FALSE)","v":"www.oracle.com"}]
[499,"ORACL006","(ORACL006) Oracle Certified Master (OCM): Java Developer","Oracle Certified Master (OCM): Java Developer",2,499,"Oracle Corporation",{"$f":"VLOOKUP(B500,Certifications!$A$2:$D$844,4,FALSE)","v":"www.oracle.com"}]
[500,"ORACL007","(ORACL007) Oracle Certified Expert (OCE): Database SQL","Oracle Certified Expert (OCE): Database SQL",1,500,"Oracle Corporation",{"$f":"VLOOKUP(B501,Certifications!$A$2:$D$844,4,FALSE)","v":"www.oracle.com"}]
[501,"PRMIN001","(PRMIN001) Project Management Professional (PMP)","Project Management Professional (PMP)",1,501,"Project Management Institute",{"$f":"VLOOKUP(B502,Certifications!$A$2:$D$844,4,FALSE)","v":"www.pmi.org"}]
[502,"PRMIN003","(PRMIN003) Certified Associate in Project Management (CAPM)","Certified Associate in Project Management (CAPM)",1,502,"Project Management Institute",{"$f":"VLOOKUP(B503,Certifications!$A$2:$D$844,4,FALSE)","v":"www.pmi.org"}]
[503,"PROSO003","(PROSO003) Certified Internet Web (CIW) E-Commerce Specialist","Certified Internet Web (CIW) E-Commerce Specialist",2,503,"Certification Partners",{"$f":"VLOOKUP(B504,Certifications!$A$2:$D$844,4,FALSE)","v":"www.ciwcertified.com"}]
[504,"PROSO006","(PROSO006) Certified Internet Web (CIW) Database Design Specialist","Certified Internet Web (CIW) Database Design Specialist",2,504,"Certification Partners",{"$f":"VLOOKUP(B505,Certifications!$A$2:$D$844,4,FALSE)","v":"www.ciwcertified.com"}]
[505,"PROSO010","(PROSO010) Certified Internet Web (CIW) Web Security Professional","Certified Internet Web (CIW) Web Security Professional",2,505,"Certification Partners",{"$f":"VLOOKUP(B506,Certifications!$A$2:$D$844,4,FALSE)","v":"www.ciwcertified.com"}]
[506,"PROSO016","(PROSO016) Certified Internet Web (CIW) Internet Business Associate","Certified Internet Web (CIW) Internet Business Associate",1,506,"Certification Partners",{"$f":"VLOOKUP(B507,Certifications!$A$2:$D$844,4,FALSE)","v":"www.ciwcertified.com"}]
[507,"PROSO017","(PROSO017) Certified Internet Web (CIW) JavaScript Specialist","Certified Internet Web (CIW) JavaScript Specialist",2,507,"Certification Partners",{"$f":"VLOOKUP(B508,Certifications!$A$2:$D$844,4,FALSE)","v":"www.ciwcertified.com"}]
[508,"PROSO018","(PROSO018) Certified Internet Web (CIW) Network Technology Associate","Certified Internet Web (CIW) Network Technology Associate",1,508,"Certification Partners",{"$f":"VLOOKUP(B509,Certifications!$A$2:$D$844,4,FALSE)","v":"www.ciwcertified.com"}]
[509,"PROSO019","(PROSO019) Certified Internet Web (CIW) Perl Specialist","Certified Internet Web (CIW) Perl Specialist",2,509,"Certification Partners",{"$f":"VLOOKUP(B510,Certifications!$A$2:$D$844,4,FALSE)","v":"www.ciwcertified.com"}]
[510,"PROSO020","(PROSO020) Certified Internet Web (CIW) Site Development Associate","Certified Internet Web (CIW) Site Development Associate",1,510,"Certification Partners",{"$f":"VLOOKUP(B511,Certifications!$A$2:$D$844,4,FALSE)","v":"www.ciwcertified.com"}]
[511,"PROSO021","(PROSO021) Certified Internet Web (CIW) Web Design Professional","Certified Internet Web (CIW) Web Design Professional",2,511,"Certification Partners",{"$f":"VLOOKUP(B512,Certifications!$A$2:$D$844,4,FALSE)","v":"www.ciwcertified.com"}]
[512,"PROSO022","(PROSO022) Certified Internet Web (CIW) Web Design Specialist","Certified Internet Web (CIW) Web Design Specialist",2,512,"Certification Partners",{"$f":"VLOOKUP(B513,Certifications!$A$2:$D$844,4,FALSE)","v":"www.ciwcertified.com"}]
[513,"PROSO023","(PROSO023) Certified Internet Web (CIW) Web Development Professional","Certified Internet Web (CIW) Web Development Professional",2,513,"Certification Partners",{"$f":"VLOOKUP(B514,Certifications!$A$2:$D$844,4,FALSE)","v":"www.ciwcertified.com"}]
[514,"PROSO024","(PROSO024) Certified Internet Web (CIW) Web Foundations Associate","Certified Internet Web (CIW) Web Foundations Associate",1,514,"Certification Partners",{"$f":"VLOOKUP(B515,Certifications!$A$2:$D$844,4,FALSE)","v":"www.ciwcertified.com"}]
[515,"PROSO025","(PROSO025) Certified Internet Web (CIW) Web Security Associate","Certified Internet Web (CIW) Web Security Associate",1,515,"Certification Partners",{"$f":"VLOOKUP(B516,Certifications!$A$2:$D$844,4,FALSE)","v":"www.ciwcertified.com"}]
[516,"PROSO026","(PROSO026) Certified Internet Web (CIW) Web Security Specialist","Certified Internet Web (CIW) Web Security Specialist",2,516,"Certification Partners",{"$f":"VLOOKUP(B517,Certifications!$A$2:$D$844,4,FALSE)","v":"www.ciwcertified.com"}]
[517,"PROSO027","(PROSO027) Certified Internet Web (CIW) Advanced HTML5 & CSS3 Specialist","Certified Internet Web (CIW) Advanced HTML5 & CSS3 Specialist",2,517,"Certification Partners",{"$f":"VLOOKUP(B518,Certifications!$A$2:$D$844,4,FALSE)","v":"www.ciwcertified.com"}]
[518,"PROSO028","(PROSO028) Certified Internet Web (CIW) Data Analyst","Certified Internet Web (CIW) Data Analyst",1,518,"Certification Partners",{"$f":"VLOOKUP(B519,Certifications!$A$2:$D$844,4,FALSE)","v":"www.ciwcertified.com"}]
[519,"PROSO029","(PROSO029) Certified Internet Web (CIW) User Interface Designer","Certified Internet Web (CIW) User Interface Designer",1,519,"Certification Partners",{"$f":"VLOOKUP(B520,Certifications!$A$2:$D$844,4,FALSE)","v":"www.ciwcertified.com"}]
[520,"PROSO030","(PROSO030) Certified Internet Web (CIW) Data Analyst Specialist","Certified Internet Web (CIW) Data Analyst Specialist",1,520,"Certification Partners",{"$f":"VLOOKUP(B521,Certifications!$A$2:$D$844,4,FALSE)","v":"www.ciwcertified.com"}]
[521,"PROSO031","(PROSO031) Certified Internet Web (CIW) Social Media Strategist","Certified Internet Web (CIW) Social Media Strategist",1,521,"Certification Partners",{"$f":"VLOOKUP(B522,Certifications!$A$2:$D$844,4,FALSE)","v":"www.ciwcertified.com"}]
[522,"PROSO032","(PROSO032) Certified Internet Web (CIW) User Interface Designer","Certified Internet Web (CIW) User Interface Designer",1,522,"Certification Partners",{"$f":"VLOOKUP(B523,Certifications!$A$2:$D$844,4,FALSE)","v":"www.ciwcertified.com"}]
[523,"PTCBD001","(PTCBD001) Pharmacy Technician","Pharmacy Technician",2,523,"Pharmacy Technician Certification Board",{"$f":"VLOOKUP(B524,Certifications!$A$2:$D$844,4,FALSE)","v":"www.ptcb.org/"}]
[524,"SALES001","(SALES001) Salesforce Certified Administrator","Salesforce Certified Administrator",1,524,"Salesforce",{"$f":"VLOOKUP(B525,Certifications!$A$2:$D$844,4,FALSE)","v":"www.salesforce.com"}]
[525,"SMFEN001","(SMFEN001) Lean Bronze Certification (LBC)","Lean Bronze Certification (LBC)",2,525,"Society of Manufacturing Engineers",{"$f":"VLOOKUP(B526,Certifications!$A$2:$D$844,4,FALSE)","v":"www.sme.org"}]
[526,"SMRPR001","(SMRPR001) Certified Maintenance and Reliability Professional (CMRP)","Certified Maintenance and Reliability Professional (CMRP)",2,526,"Society for Maintenance and Reliability Professionals",{"$f":"VLOOKUP(B527,Certifications!$A$2:$D$844,4,FALSE)","v":"www.smrp.org"}]
[527,"SOCTE004","(SOCTE004) Broadband Premises Installer (BPI)","Broadband Premises Installer (BPI)",1,527,"Society of Cable Telecommunications Engineers",{"$f":"VLOOKUP(B528,Certifications!$A$2:$D$844,4,FALSE)","v":"www.scte.org/"}]
[528,"SOLID003","(SOLID003) Certified Solidworks Associate-Academic (CSWA-Academic)","Certified Solidworks Associate-Academic (CSWA-Academic)",1,528,"Dassault Systems Solidworks Corporation",{"$f":"VLOOKUP(B529,Certifications!$A$2:$D$844,4,FALSE)","v":"www.solidworks.com/pages/services/Training/Training.html"}]
[529,"SOLID004","(SOLID004) Certified Solidworks Professional-Academic (CSWP-Academic)","Certified Solidworks Professional-Academic (CSWP-Academic)",2,529,"Dassault Systems Solidworks Corporation",{"$f":"VLOOKUP(B530,Certifications!$A$2:$D$844,4,FALSE)","v":"www.solidworks.com/pages/services/Training/Training.html"}]
[530,"SPACE001","(SPACE001) Aerospace Technician","Aerospace Technician",2,530,"SpaceTec",{"$f":"VLOOKUP(B531,Certifications!$A$2:$D$844,4,FALSE)","v":"www.spacetec.org/"}]
[531,"TAFLP001","(TAFLP001) Accredited Legal Professional (ALP)","Accredited Legal Professional (ALP)",1,531,"NALS…the Association for Legal Professionals",{"$f":"VLOOKUP(B532,Certifications!$A$2:$D$844,4,FALSE)","v":"www.nals.org"}]
[532,"TAFLP002","(TAFLP002) Professional Legal Secretary (PLS)","Professional Legal Secretary (PLS)",1,532,"NALS…the Association for Legal Professionals",{"$f":"VLOOKUP(B533,Certifications!$A$2:$D$844,4,FALSE)","v":"www.nals.org"}]
[533,"TAFOM001","(TAFOM001) Certified in Production and Inventory Management (CPIM) ","Certified in Production and Inventory Management (CPIM) ",2,533,"American Production and Inventory Control Society (APICS)",{"$f":"VLOOKUP(B534,Certifications!$A$2:$D$844,4,FALSE)","v":"www.apics.org"}]
[534,"TBOOM001","(TBOOM001) Toon Boom Certified Associate (Harmony Premium)","Toon Boom Certified Associate (Harmony Premium)",1,534,"Toon Boom Animation",{"$f":"VLOOKUP(B535,Certifications!$A$2:$D$844,4,FALSE)","v":"www.toonboom.com/"}]
[535,"TBOOM003","(TBOOM003) Toon Boom Certified Associate (Storyboard Pro)","Toon Boom Certified Associate (Storyboard Pro)",1,535,"Toon Boom Animation",{"$f":"VLOOKUP(B536,Certifications!$A$2:$D$844,4,FALSE)","v":"www.toonboom.com/"}]
[536,"UNITY001","(UNITY001) Unity Certified Associate","Unity Certified Associate",1,536,"Unity Technologies",{"$f":"VLOOKUP(B537,Certifications!$A$2:$D$844,4,FALSE)","v":"https://certification.unity.com"}]
[537,"UNITY002","(UNITY002) Unity Certified User: Programmer","Unity Certified User: Programmer",1,537,"Unity Technologies",{"$f":"VLOOKUP(B538,Certifications!$A$2:$D$844,4,FALSE)","v":"https://certification.unity.com"}]
[538,"USINS001","(USINS001) Small UAS Safety Certification","Small UAS Safety Certification",1,538,"Unmanned Safety Institute",{"$f":"VLOOKUP(B539,Certifications!$A$2:$D$844,4,FALSE)","v":"unmannedsafetyinstitute.org/"}]
[539,"VMWRE004","(VMWRE004) VMware Certified Professional - Data Center Virtualization","VMware Certified Professional - Data Center Virtualization",2,539,"VMWare",{"$f":"VLOOKUP(B540,Certifications!$A$2:$D$844,4,FALSE)","v":"www.vmware.com"}]
[540,null,null,null,null,null,null,{"$f":"VLOOKUP(B541,Certifications!$A$2:$D$844,4,FALSE)","v":{"$error":"#N/A"}}]
[541,null,null,null,null,null,null,{"$f":"VLOOKUP(B542,Certifications!$A$2:$D$844,4,FALSE)","v":{"$error":"#N/A"}}]
[542,null,null,null,null,null,null,{"$f":"VLOOKUP(B543,Certifications!$A$2:$D$844,4,FALSE)","v":{"$error":"#N/A"}}]
[543,null,null,null,null,null,null,{"$f":"VLOOKUP(B544,Certifications!$A$2:$D$844,4,FALSE)","v":{"$error":"#N/A"}}]
[544,null,null,null,null,null,null,{"$f":"VLOOKUP(B545,Certifications!$A$2:$D$844,4,FALSE)","v":{"$error":"#N/A"}}]
[545,null,null,null,null,null,null,{"$f":"VLOOKUP(B546,Certifications!$A$2:$D$844,4,FALSE)","v":{"$error":"#N/A"}}]
[546,null,null,null,null,null,null,{"$f":"VLOOKUP(B547,Certifications!$A$2:$D$844,4,FALSE)","v":{"$error":"#N/A"}}]
[547,null,null,null,null,null,null,{"$f":"VLOOKUP(B548,Certifications!$A$2:$D$844,4,FALSE)","v":{"$error":"#N/A"}}]
[548,null,null,null,null,null,null,{"$f":"VLOOKUP(B549,Certifications!$A$2:$D$844,4,FALSE)","v":{"$error":"#N/A"}}]
[549,null,null,null,null,null,null,{"$f":"VLOOKUP(B550,Certifications!$A$2:$D$844,4,FALSE)","v":{"$error":"#N/A"}}]
[550,null,null,null,null,null,null,{"$f":"VLOOKUP(B551,Certifications!$A$2:$D$844,4,FALSE)","v":{"$error":"#N/A"}}]
[551,null,null,null,null,null,null,{"$f":"VLOOKUP(B552,Certifications!$A$2:$D$844,4,FALSE)","v":{"$error":"#N/A"}}]
[552,null,null,null,null,null,null,{"$f":"VLOOKUP(B553,Certifications!$A$2:$D$844,4,FALSE)","v":{"$error":"#N/A"}}]
[553,null,null,null,null,null,null,{"$f":"VLOOKUP(B554,Certifications!$A$2:$D$844,4,FALSE)","v":{"$error":"#N/A"}}]
[554,null,null,null,null,null,null,{"$f":"VLOOKUP(B555,Certifications!$A$2:$D$844,4,FALSE)","v":{"$error":"#N/A"}}]
[555,null,null,null,null,null,null,{"$f":"VLOOKUP(B556,Certifications!$A$2:$D$844,4,FALSE)","v":{"$error":"#N/A"}}]
[556,null,null,null,null,null,null,{"$f":"VLOOKUP(B557,Certifications!$A$2:$D$844,4,FALSE)","v":{"$error":"#N/A"}}]
[557,null,null,null,null,null,null,{"$f":"VLOOKUP(B558,Certifications!$A$2:$D$844,4,FALSE)","v":{"$error":"#N/A"}}]
[558,null,null,null,null,null,null,{"$f":"VLOOKUP(B559,Certifications!$A$2:$D$844,4,FALSE)","v":{"$error":"#N/A"}}]
[559,null,null,null,null,null,null,{"$f":"VLOOKUP(B560,Certifications!$A$2:$D$844,4,FALSE)","v":{"$error":"#N/A"}}]
[560,null,null,null,null,null,null,{"$f":"VLOOKUP(B561,Certifications!$A$2:$D$844,4,FALSE)","v":{"$error":"#N/A"}}]
[561,null,null,null,null,null,null,{"$f":"VLOOKUP(B562,Certifications!$A$2:$D$844,4,FALSE)","v":{"$error":"#N/A"}}]
[562,null,null,null,null,null,null,{"$f":"VLOOKUP(B563,Certifications!$A$2:$D$844,4,FALSE)","v":{"$error":"#N/A"}}]
[563,null,null,null,null,null,null,{"$f":"VLOOKUP(B564,Certifications!$A$2:$D$844,4,FALSE)","v":{"$error":"#N/A"}}]
[564,null,null,null,null,null,null,{"$f":"VLOOKUP(B565,Certifications!$A$2:$D$844,4,FALSE)","v":{"$error":"#N/A"}}]
[565,null,null,null,null,null,null,{"$f":"VLOOKUP(B566,Certifications!$A$2:$D$844,4,FALSE)","v":{"$error":"#N/A"}}]
[566,null,null,null,null,null,null,{"$f":"VLOOKUP(B567,Certifications!$A$2:$D$844,4,FALSE)","v":{"$error":"#N/A"}}]
[567,null,null,null,null,null,null,{"$f":"VLOOKUP(B568,Certifications!$A$2:$D$844,4,FALSE)","v":{"$error":"#N/A"}}]
[568,null,null,null,null,null,null,{"$f":"VLOOKUP(B569,Certifications!$A$2:$D$844,4,FALSE)","v":{"$error":"#N/A"}}]
[569,null,null,null,null,null,null,{"$f":"VLOOKUP(B570,Certifications!$A$2:$D$844,4,FALSE)","v":{"$error":"#N/A"}}]
[570,null,null,null,null,null,null,{"$f":"VLOOKUP(B571,Certifications!$A$2:$D$844,4,FALSE)","v":{"$error":"#N/A"}}]
[571,null,null,null,null,null,null,{"$f":"VLOOKUP(B572,Certifications!$A$2:$D$844,4,FALSE)","v":{"$error":"#N/A"}}]
[572,null,null,null,null,null,null,{"$f":"VLOOKUP(B573,Certifications!$A$2:$D$844,4,FALSE)","v":{"$error":"#N/A"}}]
[573,null,null,null,null,null,null,{"$f":"VLOOKUP(B574,Certifications!$A$2:$D$844,4,FALSE)","v":{"$error":"#N/A"}}]
[574,null,null,null,null,null,null,{"$f":"VLOOKUP(B575,Certifications!$A$2:$D$844,4,FALSE)","v":{"$error":"#N/A"}}]
[575,null,null,null,null,null,null,{"$f":"VLOOKUP(B576,Certifications!$A$2:$D$844,4,FALSE)","v":{"$error":"#N/A"}}]
[576,null,null,null,null,null,null,{"$f":"VLOOKUP(B577,Certifications!$A$2:$D$844,4,FALSE)","v":{"$error":"#N/A"}}]
[577,null,null,null,null,null,null,{"$f":"VLOOKUP(B578,Certifications!$A$2:$D$844,4,FALSE)","v":{"$error":"#N/A"}}]
[578,null,null,null,null,null,null,{"$f":"VLOOKUP(B579,Certifications!$A$2:$D$844,4,FALSE)","v":{"$error":"#N/A"}}]
[579,null,null,null,null,null,null,{"$f":"VLOOKUP(B580,Certifications!$A$2:$D$844,4,FALSE)","v":{"$error":"#N/A"}}]
[580,null,null,null,null,null,null,{"$f":"VLOOKUP(B581,Certifications!$A$2:$D$844,4,FALSE)","v":{"$error":"#N/A"}}]
[581,null,null,null,null,null,null,{"$f":"VLOOKUP(B582,Certifications!$A$2:$D$844,4,FALSE)","v":{"$error":"#N/A"}}]
[582,null,null,null,null,null,null,{"$f":"VLOOKUP(B583,Certifications!$A$2:$D$844,4,FALSE)","v":{"$error":"#N/A"}}]
[583,null,null,null,null,null,null,{"$f":"VLOOKUP(B584,Certifications!$A$2:$D$844,4,FALSE)","v":{"$error":"#N/A"}}]
[584,null,null,null,null,null,null,{"$f":"VLOOKUP(B585,Certifications!$A$2:$D$844,4,FALSE)","v":{"$error":"#N/A"}}]
[585,null,null,null,null,null,null,{"$f":"VLOOKUP(B586,Certifications!$A$2:$D$844,4,FALSE)","v":{"$error":"#N/A"}}]
[586,null,null,null,null,null,null,{"$f":"VLOOKUP(B587,Certifications!$A$2:$D$844,4,FALSE)","v":{"$error":"#N/A"}}]
[587,null,null,null,null,null,null,{"$f":"VLOOKUP(B588,Certifications!$A$2:$D$844,4,FALSE)","v":{"$error":"#N/A"}}]
[588,null,null,null,null,null,null,{"$f":"VLOOKUP(B589,Certifications!$A$2:$D$844,4,FALSE)","v":{"$error":"#N/A"}}]
[589,null,null,null,null,null,null,{"$f":"VLOOKUP(B590,Certifications!$A$2:$D$844,4,FALSE)","v":{"$error":"#N/A"}}]
[590,null,null,null,null,null,null,{"$f":"VLOOKUP(B591,Certifications!$A$2:$D$844,4,FALSE)","v":{"$error":"#N/A"}}]
[591,null,null,null,null,null,null,{"$f":"VLOOKUP(B592,Certifications!$A$2:$D$844,4,FALSE)","v":{"$error":"#N/A"}}]
[592,null,null,null,null,null,null,{"$f":"VLOOKUP(B593,Certifications!$A$2:$D$844,4,FALSE)","v":{"$error":"#N/A"}}]
[593,null,null,null,null,null,null,{"$f":"VLOOKUP(B594,Certifications!$A$2:$D$844,4,FALSE)","v":{"$error":"#N/A"}}]
[594,null,null,null,null,null,null,{"$f":"VLOOKUP(B595,Certifications!$A$2:$D$844,4,FALSE)","v":{"$error":"#N/A"}}]
[595,null,null,null,null,null,null,{"$f":"VLOOKUP(B596,Certifications!$A$2:$D$844,4,FALSE)","v":{"$error":"#N/A"}}]
[596,null,null,null,null,null,null,{"$f":"VLOOKUP(B597,Certifications!$A$2:$D$844,4,FALSE)","v":{"$error":"#N/A"}}]
[597,null,null,null,null,null,null,{"$f":"VLOOKUP(B598,Certifications!$A$2:$D$844,4,FALSE)","v":{"$error":"#N/A"}}]
[598,null,null,null,null,null,null,{"$f":"VLOOKUP(B599,Certifications!$A$2:$D$844,4,FALSE)","v":{"$error":"#N/A"}}]
[599,null,null,null,null,null,null,{"$f":"VLOOKUP(B600,Certifications!$A$2:$D$844,4,FALSE)","v":{"$error":"#N/A"}}]
[600,null,null,null,null,null,null,{"$f":"VLOOKUP(B601,Certifications!$A$2:$D$844,4,FALSE)","v":{"$error":"#N/A"}}]
[601,null,null,null,null,null,null,{"$f":"VLOOKUP(B602,Certifications!$A$2:$D$844,4,FALSE)","v":{"$error":"#N/A"}}]
[602,null,null,null,null,null,null,{"$f":"VLOOKUP(B603,Certifications!$A$2:$D$844,4,FALSE)","v":{"$error":"#N/A"}}]
[603,null,null,null,null,null,null,{"$f":"VLOOKUP(B604,Certifications!$A$2:$D$844,4,FALSE)","v":{"$error":"#N/A"}}]
[604,null,null,null,null,null,null,{"$f":"VLOOKUP(B605,Certifications!$A$2:$D$844,4,FALSE)","v":{"$error":"#N/A"}}]
[605,null,null,null,null,null,null,{"$f":"VLOOKUP(B606,Certifications!$A$2:$D$844,4,FALSE)","v":{"$error":"#N/A"}}]
[606,null,null,null,null,null,null,{"$f":"VLOOKUP(B607,Certifications!$A$2:$D$844,4,FALSE)","v":{"$error":"#N/A"}}]
[607,null,null,null,null,null,null,{"$f":"VLOOKUP(B608,Certifications!$A$2:$D$844,4,FALSE)","v":{"$error":"#N/A"}}]
[608,null,null,null,null,null,null,{"$f":"VLOOKUP(B609,Certifications!$A$2:$D$844,4,FALSE)","v":{"$error":"#N/A"}}]
[609,null,null,null,null,null,null,{"$f":"VLOOKUP(B610,Certifications!$A$2:$D$844,4,FALSE)","v":{"$error":"#N/A"}}]
[610,null,null,null,null,null,null,{"$f":"VLOOKUP(B611,Certifications!$A$2:$D$844,4,FALSE)","v":{"$error":"#N/A"}}]
[611,null,null,null,null,null,null,{"$f":"VLOOKUP(B612,Certifications!$A$2:$D$844,4,FALSE)","v":{"$error":"#N/A"}}]
[612,null,null,null,null,null,null,{"$f":"VLOOKUP(B613,Certifications!$A$2:$D$844,4,FALSE)","v":{"$error":"#N/A"}}]
[613,null,null,null,null,null,null,{"$f":"VLOOKUP(B614,Certifications!$A$2:$D$844,4,FALSE)","v":{"$error":"#N/A"}}]
[614,null,null,null,null,null,null,{"$f":"VLOOKUP(B615,Certifications!$A$2:$D$844,4,FALSE)","v":{"$error":"#N/A"}}]
[615,null,null,null,null,null,null,{"$f":"VLOOKUP(B616,Certifications!$A$2:$D$844,4,FALSE)","v":{"$error":"#N/A"}}]
[616,null,null,null,null,null,null,{"$f":"VLOOKUP(B617,Certifications!$A$2:$D$844,4,FALSE)","v":{"$error":"#N/A"}}]
[617,null,null,null,null,null,null,{"$f":"VLOOKUP(B618,Certifications!$A$2:$D$844,4,FALSE)","v":{"$error":"#N/A"}}]
[618,null,null,null,null,null,null,{"$f":"VLOOKUP(B619,Certifications!$A$2:$D$844,4,FALSE)","v":{"$error":"#N/A"}}]
[619,null,null,null,null,null,null,{"$f":"VLOOKUP(B620,Certifications!$A$2:$D$844,4,FALSE)","v":{"$error":"#N/A"}}]
[620,null,null,null,null,null,null,{"$f":"VLOOKUP(B621,Certifications!$A$2:$D$844,4,FALSE)","v":{"$error":"#N/A"}}]
[621,null,null,null,null,null,null,{"$f":"VLOOKUP(B622,Certifications!$A$2:$D$844,4,FALSE)","v":{"$error":"#N/A"}}]
[622,null,null,null,null,null,null,{"$f":"VLOOKUP(B623,Certifications!$A$2:$D$844,4,FALSE)","v":{"$error":"#N/A"}}]
[623,null,null,null,null,null,null,{"$f":"VLOOKUP(B624,Certifications!$A$2:$D$844,4,FALSE)","v":{"$error":"#N/A"}}]
[624,null,null,null,null,null,null,{"$f":"VLOOKUP(B625,Certifications!$A$2:$D$844,4,FALSE)","v":{"$error":"#N/A"}}]
[625,null,null,null,null,null,null,{"$f":"VLOOKUP(B626,Certifications!$A$2:$D$844,4,FALSE)","v":{"$error":"#N/A"}}]
[626,null,null,null,null,null,null,{"$f":"VLOOKUP(B627,Certifications!$A$2:$D$844,4,FALSE)","v":{"$error":"#N/A"}}]
[627,null,null,null,null,null,null,{"$f":"VLOOKUP(B628,Certifications!$A$2:$D$844,4,FALSE)","v":{"$error":"#N/A"}}]
[628,null,null,null,null,null,null,{"$f":"VLOOKUP(B629,Certifications!$A$2:$D$844,4,FALSE)","v":{"$error":"#N/A"}}]
[629,null,null,null,null,null,null,{"$f":"VLOOKUP(B630,Certifications!$A$2:$D$844,4,FALSE)","v":{"$error":"#N/A"}}]
[630,null,null,null,null,null,null,{"$f":"VLOOKUP(B631,Certifications!$A$2:$D$844,4,FALSE)","v":{"$error":"#N/A"}}]
[631,null,null,null,null,null,null,{"$f":"VLOOKUP(B632,Certifications!$A$2:$D$844,4,FALSE)","v":{"$error":"#N/A"}}]
[632,null,null,null,null,null,null,{"$f":"VLOOKUP(B633,Certifications!$A$2:$D$844,4,FALSE)","v":{"$error":"#N/A"}}]
[633,null,null,null,null,null,null,{"$f":"VLOOKUP(B634,Certifications!$A$2:$D$844,4,FALSE)","v":{"$error":"#N/A"}}]
[634,null,null,null,null,null,null,{"$f":"VLOOKUP(B635,Certifications!$A$2:$D$844,4,FALSE)","v":{"$error":"#N/A"}}]
[635,null,null,null,null,null,null,{"$f":"VLOOKUP(B636,Certifications!$A$2:$D$844,4,FALSE)","v":{"$error":"#N/A"}}]
[636,null,null,null,null,null,null,{"$f":"VLOOKUP(B637,Certifications!$A$2:$D$844,4,FALSE)","v":{"$error":"#N/A"}}]
[637,null,null,null,null,null,null,{"$f":"VLOOKUP(B638,Certifications!$A$2:$D$844,4,FALSE)","v":{"$error":"#N/A"}}]
[638,null,null,null,null,null,null,{"$f":"VLOOKUP(B639,Certifications!$A$2:$D$844,4,FALSE)","v":{"$error":"#N/A"}}]
[639,null,null,null,null,null,null,{"$f":"VLOOKUP(B640,Certifications!$A$2:$D$844,4,FALSE)","v":{"$error":"#N/A"}}]
[640,null,null,null,null,null,null,{"$f":"VLOOKUP(B641,Certifications!$A$2:$D$844,4,FALSE)","v":{"$error":"#N/A"}}]
[641,null,null,null,null,null,null,{"$f":"VLOOKUP(B642,Certifications!$A$2:$D$844,4,FALSE)","v":{"$error":"#N/A"}}]
[642,null,null,null,null,null,null,{"$f":"VLOOKUP(B643,Certifications!$A$2:$D$844,4,FALSE)","v":{"$error":"#N/A"}}]
[643,null,null,null,null,null,null,{"$f":"VLOOKUP(B644,Certifications!$A$2:$D$844,4,FALSE)","v":{"$error":"#N/A"}}]
[644,null,null,null,null,null,null,{"$f":"VLOOKUP(B645,Certifications!$A$2:$D$844,4,FALSE)","v":{"$error":"#N/A"}}]
[645,null,null,null,null,null,null,{"$f":"VLOOKUP(B646,Certifications!$A$2:$D$844,4,FALSE)","v":{"$error":"#N/A"}}]
[646,null,null,null,null,null,null,{"$f":"VLOOKUP(B647,Certifications!$A$2:$D$844,4,FALSE)","v":{"$error":"#N/A"}}]
[647,null,null,null,null,null,null,{"$f":"VLOOKUP(B648,Certifications!$A$2:$D$844,4,FALSE)","v":{"$error":"#N/A"}}]
[648,null,null,null,null,null,null,{"$f":"VLOOKUP(B649,Certifications!$A$2:$D$844,4,FALSE)","v":{"$error":"#N/A"}}]
[649,null,null,null,null,null,null,{"$f":"VLOOKUP(B650,Certifications!$A$2:$D$844,4,FALSE)","v":{"$error":"#N/A"}}]
[650,null,null,null,null,null,null,{"$f":"VLOOKUP(B651,Certifications!$A$2:$D$844,4,FALSE)","v":{"$error":"#N/A"}}]
[651,null,null,null,null,null,null,{"$f":"VLOOKUP(B652,Certifications!$A$2:$D$844,4,FALSE)","v":{"$error":"#N/A"}}]
[652,null,null,null,null,null,null,{"$f":"VLOOKUP(B653,Certifications!$A$2:$D$844,4,FALSE)","v":{"$error":"#N/A"}}]
[653,null,null,null,null,null,null,{"$f":"VLOOKUP(B654,Certifications!$A$2:$D$844,4,FALSE)","v":{"$error":"#N/A"}}]
[654,null,null,null,null,null,null,{"$f":"VLOOKUP(B655,Certifications!$A$2:$D$844,4,FALSE)","v":{"$error":"#N/A"}}]
[655,null,null,null,null,null,null,{"$f":"VLOOKUP(B656,Certifications!$A$2:$D$844,4,FALSE)","v":{"$error":"#N/A"}}]
[656,null,null,null,null,null,null,{"$f":"VLOOKUP(B657,Certifications!$A$2:$D$844,4,FALSE)","v":{"$error":"#N/A"}}]
[657,null,null,null,null,null,null,{"$f":"VLOOKUP(B658,Certifications!$A$2:$D$844,4,FALSE)","v":{"$error":"#N/A"}}]
[658,null,null,null,null,null,null,{"$f":"VLOOKUP(B659,Certifications!$A$2:$D$844,4,FALSE)","v":{"$error":"#N/A"}}]
[659,null,null,null,null,null,null,{"$f":"VLOOKUP(B660,Certifications!$A$2:$D$844,4,FALSE)","v":{"$error":"#N/A"}}]
[660,null,null,null,null,null,null,{"$f":"VLOOKUP(B661,Certifications!$A$2:$D$844,4,FALSE)","v":{"$error":"#N/A"}}]
[661,null,null,null,null,null,null,{"$f":"VLOOKUP(B662,Certifications!$A$2:$D$844,4,FALSE)","v":{"$error":"#N/A"}}]
[662,null,null,null,null,null,null,{"$f":"VLOOKUP(B663,Certifications!$A$2:$D$844,4,FALSE)","v":{"$error":"#N/A"}}]
[663,null,null,null,null,null,null,{"$f":"VLOOKUP(B664,Certifications!$A$2:$D$844,4,FALSE)","v":{"$error":"#N/A"}}]
[664,null,null,null,null,null,null,{"$f":"VLOOKUP(B665,Certifications!$A$2:$D$844,4,FALSE)","v":{"$error":"#N/A"}}]
[665,null,null,null,null,null,null,{"$f":"VLOOKUP(B666,Certifications!$A$2:$D$844,4,FALSE)","v":{"$error":"#N/A"}}]
[666,null,null,null,null,null,null,{"$f":"VLOOKUP(B667,Certifications!$A$2:$D$844,4,FALSE)","v":{"$error":"#N/A"}}]
[667,null,null,null,null,null,null,{"$f":"VLOOKUP(B668,Certifications!$A$2:$D$844,4,FALSE)","v":{"$error":"#N/A"}}]
[668,null,null,null,null,null,null,{"$f":"VLOOKUP(B669,Certifications!$A$2:$D$844,4,FALSE)","v":{"$error":"#N/A"}}]
[669,null,null,null,null,null,null,{"$f":"VLOOKUP(B670,Certifications!$A$2:$D$844,4,FALSE)","v":{"$error":"#N/A"}}]
[670,null,null,null,null,null,null,{"$f":"VLOOKUP(B671,Certifications!$A$2:$D$844,4,FALSE)","v":{"$error":"#N/A"}}]
[671,null,null,null,null,null,null,{"$f":"VLOOKUP(B672,Certifications!$A$2:$D$844,4,FALSE)","v":{"$error":"#N/A"}}]
[672,null,null,null,null,null,null,{"$f":"VLOOKUP(B673,Certifications!$A$2:$D$844,4,FALSE)","v":{"$error":"#N/A"}}]
[673,null,null,null,null,null,null,{"$f":"VLOOKUP(B674,Certifications!$A$2:$D$844,4,FALSE)","v":{"$error":"#N/A"}}]
[674,null,null,null,null,null,null,{"$f":"VLOOKUP(B675,Certifications!$A$2:$D$844,4,FALSE)","v":{"$error":"#N/A"}}]
[675,null,null,null,null,null,null,{"$f":"VLOOKUP(B676,Certifications!$A$2:$D$844,4,FALSE)","v":{"$error":"#N/A"}}]
[676,null,null,null,null,null,null,{"$f":"VLOOKUP(B677,Certifications!$A$2:$D$844,4,FALSE)","v":{"$error":"#N/A"}}]
[677,null,null,null,null,null,null,{"$f":"VLOOKUP(B678,Certifications!$A$2:$D$844,4,FALSE)","v":{"$error":"#N/A"}}]
[678,null,null,null,null,null,null,{"$f":"VLOOKUP(B679,Certifications!$A$2:$D$844,4,FALSE)","v":{"$error":"#N/A"}}]
[679,null,null,null,null,null,null,{"$f":"VLOOKUP(B680,Certifications!$A$2:$D$844,4,FALSE)","v":{"$error":"#N/A"}}]
[680,null,null,null,null,null,null,{"$f":"VLOOKUP(B681,Certifications!$A$2:$D$844,4,FALSE)","v":{"$error":"#N/A"}}]
[681,null,null,null,null,null,null,{"$f":"VLOOKUP(B682,Certifications!$A$2:$D$844,4,FALSE)","v":{"$error":"#N/A"}}]
[682,null,null,null,null,null,null,{"$f":"VLOOKUP(B683,Certifications!$A$2:$D$844,4,FALSE)","v":{"$error":"#N/A"}}]
[683,null,null,null,null,null,null,{"$f":"VLOOKUP(B684,Certifications!$A$2:$D$844,4,FALSE)","v":{"$error":"#N/A"}}]
[684,null,null,null,null,null,null,{"$f":"VLOOKUP(B685,Certifications!$A$2:$D$844,4,FALSE)","v":{"$error":"#N/A"}}]
[685,null,null,null,null,null,null,{"$f":"VLOOKUP(B686,Certifications!$A$2:$D$844,4,FALSE)","v":{"$error":"#N/A"}}]
[686,null,null,null,null,null,null,{"$f":"VLOOKUP(B687,Certifications!$A$2:$D$844,4,FALSE)","v":{"$error":"#N/A"}}]
[687,null,null,null,null,null,null,{"$f":"VLOOKUP(B688,Certifications!$A$2:$D$844,4,FALSE)","v":{"$error":"#N/A"}}]
[688,null,null,null,null,null,null,{"$f":"VLOOKUP(B689,Certifications!$A$2:$D$844,4,FALSE)","v":{"$error":"#N/A"}}]
[689,null,null,null,null,null,null,{"$f":"VLOOKUP(B690,Certifications!$A$2:$D$844,4,FALSE)","v":{"$error":"#N/A"}}]
[690,null,null,null,null,null,null,{"$f":"VLOOKUP(B691,Certifications!$A$2:$D$844,4,FALSE)","v":{"$error":"#N/A"}}]
[691,null,null,null,null,null,null,{"$f":"VLOOKUP(B692,Certifications!$A$2:$D$844,4,FALSE)","v":{"$error":"#N/A"}}]
[692,null,null,null,null,null,null,{"$f":"VLOOKUP(B693,Certifications!$A$2:$D$844,4,FALSE)","v":{"$error":"#N/A"}}]
[693,null,null,null,null,null,null,{"$f":"VLOOKUP(B694,Certifications!$A$2:$D$844,4,FALSE)","v":{"$error":"#N/A"}}]
[694,null,null,null,null,null,null,{"$f":"VLOOKUP(B695,Certifications!$A$2:$D$844,4,FALSE)","v":{"$error":"#N/A"}}]
[695,null,null,null,null,null,null,{"$f":"VLOOKUP(B696,Certifications!$A$2:$D$844,4,FALSE)","v":{"$error":"#N/A"}}]
[696,null,null,null,null,null,null,{"$f":"VLOOKUP(B697,Certifications!$A$2:$D$844,4,FALSE)","v":{"$error":"#N/A"}}]
[697,null,null,null,null,null,null,{"$f":"VLOOKUP(B698,Certifications!$A$2:$D$844,4,FALSE)","v":{"$error":"#N/A"}}]
[698,null,null,null,null,null,null,{"$f":"VLOOKUP(B699,Certifications!$A$2:$D$844,4,FALSE)","v":{"$error":"#N/A"}}]
[699,null,null,null,null,null,null,{"$f":"VLOOKUP(B700,Certifications!$A$2:$D$844,4,FALSE)","v":{"$error":"#N/A"}}]
[700,null,null,null,null,null,null,{"$f":"VLOOKUP(B701,Certifications!$A$2:$D$844,4,FALSE)","v":{"$error":"#N/A"}}]
[701,null,null,null,null,null,null,{"$f":"VLOOKUP(B702,Certifications!$A$2:$D$844,4,FALSE)","v":{"$error":"#N/A"}}]
[702,null,null,null,null,null,null,{"$f":"VLOOKUP(B703,Certifications!$A$2:$D$844,4,FALSE)","v":{"$error":"#N/A"}}]
[703,null,null,null,null,null,null,{"$f":"VLOOKUP(B704,Certifications!$A$2:$D$844,4,FALSE)","v":{"$error":"#N/A"}}]
[704,null,null,null,null,null,null,{"$f":"VLOOKUP(B705,Certifications!$A$2:$D$844,4,FALSE)","v":{"$error":"#N/A"}}]
[705,null,null,null,null,null,null,{"$f":"VLOOKUP(B706,Certifications!$A$2:$D$844,4,FALSE)","v":{"$error":"#N/A"}}]
[706,null,null,null,null,null,null,{"$f":"VLOOKUP(B707,Certifications!$A$2:$D$844,4,FALSE)","v":{"$error":"#N/A"}}]
[707,null,null,null,null,null,null,{"$f":"VLOOKUP(B708,Certifications!$A$2:$D$844,4,FALSE)","v":{"$error":"#N/A"}}]
[708,null,null,null,null,null,null,{"$f":"VLOOKUP(B709,Certifications!$A$2:$D$844,4,FALSE)","v":{"$error":"#N/A"}}]
[709,null,null,null,null,null,null,{"$f":"VLOOKUP(B710,Certifications!$A$2:$D$844,4,FALSE)","v":{"$error":"#N/A"}}]
[710,null,null,null,null,null,null,{"$f":"VLOOKUP(B711,Certifications!$A$2:$D$844,4,FALSE)","v":{"$error":"#N/A"}}]
[711,null,null,null,null,null,null,{"$f":"VLOOKUP(B712,Certifications!$A$2:$D$844,4,FALSE)","v":{"$error":"#N/A"}}]
[712,null,null,null,null,null,null,{"$f":"VLOOKUP(B713,Certifications!$A$2:$D$844,4,FALSE)","v":{"$error":"#N/A"}}]
[713,null,null,null,null,null,null,{"$f":"VLOOKUP(B714,Certifications!$A$2:$D$844,4,FALSE)","v":{"$error":"#N/A"}}]
[714,null,null,null,null,null,null,{"$f":"VLOOKUP(B715,Certifications!$A$2:$D$844,4,FALSE)","v":{"$error":"#N/A"}}]
[715,null,null,null,null,null,null,{"$f":"VLOOKUP(B716,Certifications!$A$2:$D$844,4,FALSE)","v":{"$error":"#N/A"}}]
[716,null,null,null,null,null,null,{"$f":"VLOOKUP(B717,Certifications!$A$2:$D$844,4,FALSE)","v":{"$error":"#N/A"}}]
[717,null,null,null,null,null,null,{"$f":"VLOOKUP(B718,Certifications!$A$2:$D$844,4,FALSE)","v":{"$error":"#N/A"}}]
[718,null,null,null,null,null,null,{"$f":"VLOOKUP(B719,Certifications!$A$2:$D$844,4,FALSE)","v":{"$error":"#N/A"}}]
[719,null,null,null,null,null,null,{"$f":"VLOOKUP(B720,Certifications!$A$2:$D$844,4,FALSE)","v":{"$error":"#N/A"}}]
[720,null,null,null,null,null,null,{"$f":"VLOOKUP(B721,Certifications!$A$2:$D$844,4,FALSE)","v":{"$error":"#N/A"}}]
[721,null,null,null,null,null,null,{"$f":"VLOOKUP(B722,Certifications!$A$2:$D$844,4,FALSE)","v":{"$error":"#N/A"}}]
[722,null,null,null,null,null,null,{"$f":"VLOOKUP(B723,Certifications!$A$2:$D$844,4,FALSE)","v":{"$error":"#N/A"}}]
[723,null,null,null,null,null,null,{"$f":"VLOOKUP(B724,Certifications!$A$2:$D$844,4,FALSE)","v":{"$error":"#N/A"}}]
[724,null,null,null,null,null,null,{"$f":"VLOOKUP(B725,Certifications!$A$2:$D$844,4,FALSE)","v":{"$error":"#N/A"}}]
[725,null,null,null,null,null,null,{"$f":"VLOOKUP(B726,Certifications!$A$2:$D$844,4,FALSE)","v":{"$error":"#N/A"}}]
[726,null,null,null,null,null,null,{"$f":"VLOOKUP(B727,Certifications!$A$2:$D$844,4,FALSE)","v":{"$error":"#N/A"}}]
[727,null,null,null,null,null,null,{"$f":"VLOOKUP(B728,Certifications!$A$2:$D$844,4,FALSE)","v":{"$error":"#N/A"}}]
[728,null,null,null,null,null,null,{"$f":"VLOOKUP(B729,Certifications!$A$2:$D$844,4,FALSE)","v":{"$error":"#N/A"}}]
[729,null,null,null,null,null,null,{"$f":"VLOOKUP(B730,Certifications!$A$2:$D$844,4,FALSE)","v":{"$error":"#N/A"}}]
[730,null,null,null,null,null,null,{"$f":"VLOOKUP(B731,Certifications!$A$2:$D$844,4,FALSE)","v":{"$error":"#N/A"}}]
[731,null,null,null,null,null,null,{"$f":"VLOOKUP(B732,Certifications!$A$2:$D$844,4,FALSE)","v":{"$error":"#N/A"}}]
[732,null,null,null,null,null,null,{"$f":"VLOOKUP(B733,Certifications!$A$2:$D$844,4,FALSE)","v":{"$error":"#N/A"}}]
[733,null,null,null,null,null,null,{"$f":"VLOOKUP(B734,Certifications!$A$2:$D$844,4,FALSE)","v":{"$error":"#N/A"}}]
[734,null,null,null,null,null,null,{"$f":"VLOOKUP(B735,Certifications!$A$2:$D$844,4,FALSE)","v":{"$error":"#N/A"}}]
[735,null,null,null,null,null,null,{"$f":"VLOOKUP(B736,Certifications!$A$2:$D$844,4,FALSE)","v":{"$error":"#N/A"}}]
[736,null,null,null,null,null,null,{"$f":"VLOOKUP(B737,Certifications!$A$2:$D$844,4,FALSE)","v":{"$error":"#N/A"}}]
[737,null,null,null,null,null,null,{"$f":"VLOOKUP(B738,Certifications!$A$2:$D$844,4,FALSE)","v":{"$error":"#N/A"}}]
[738,null,null,null,null,null,null,{"$f":"VLOOKUP(B739,Certifications!$A$2:$D$844,4,FALSE)","v":{"$error":"#N/A"}}]
[739,null,null,null,null,null,null,{"$f":"VLOOKUP(B740,Certifications!$A$2:$D$844,4,FALSE)","v":{"$error":"#N/A"}}]
[740,null,null,null,null,null,null,{"$f":"VLOOKUP(B741,Certifications!$A$2:$D$844,4,FALSE)","v":{"$error":"#N/A"}}]
[741,null,null,null,null,null,null,{"$f":"VLOOKUP(B742,Certifications!$A$2:$D$844,4,FALSE)","v":{"$error":"#N/A"}}]
[742,null,null,null,null,null,null,{"$f":"VLOOKUP(B743,Certifications!$A$2:$D$844,4,FALSE)","v":{"$error":"#N/A"}}]
[743,null,null,null,null,null,null,{"$f":"VLOOKUP(B744,Certifications!$A$2:$D$844,4,FALSE)","v":{"$error":"#N/A"}}]
[744,null,null,null,null,null,null,{"$f":"VLOOKUP(B745,Certifications!$A$2:$D$844,4,FALSE)","v":{"$error":"#N/A"}}]
[745,null,null,null,null,null,null,{"$f":"VLOOKUP(B746,Certifications!$A$2:$D$844,4,FALSE)","v":{"$error":"#N/A"}}]
[746,null,null,null,null,null,null,{"$f":"VLOOKUP(B747,Certifications!$A$2:$D$844,4,FALSE)","v":{"$error":"#N/A"}}]
[747,null,null,null,null,null,null,{"$f":"VLOOKUP(B748,Certifications!$A$2:$D$844,4,FALSE)","v":{"$error":"#N/A"}}]
[748,null,null,null,null,null,null,{"$f":"VLOOKUP(B749,Certifications!$A$2:$D$844,4,FALSE)","v":{"$error":"#N/A"}}]
[749,null,null,null,null,null,null,{"$f":"VLOOKUP(B750,Certifications!$A$2:$D$844,4,FALSE)","v":{"$error":"#N/A"}}]
[750,null,null,null,null,null,null,{"$f":"VLOOKUP(B751,Certifications!$A$2:$D$844,4,FALSE)","v":{"$error":"#N/A"}}]
[751,null,null,null,null,null,null,{"$f":"VLOOKUP(B752,Certifications!$A$2:$D$844,4,FALSE)","v":{"$error":"#N/A"}}]
[752,null,null,null,null,null,null,{"$f":"VLOOKUP(B753,Certifications!$A$2:$D$844,4,FALSE)","v":{"$error":"#N/A"}}]
[753,null,null,null,null,null,null,{"$f":"VLOOKUP(B754,Certifications!$A$2:$D$844,4,FALSE)","v":{"$error":"#N/A"}}]
[754,null,null,null,null,null,null,{"$f":"VLOOKUP(B755,Certifications!$A$2:$D$844,4,FALSE)","v":{"$error":"#N/A"}}]
[755,null,null,null,null,null,null,{"$f":"VLOOKUP(B756,Certifications!$A$2:$D$844,4,FALSE)","v":{"$error":"#N/A"}}]
[756,null,null,null,null,null,null,{"$f":"VLOOKUP(B757,Certifications!$A$2:$D$844,4,FALSE)","v":{"$error":"#N/A"}}]
[757,null,null,null,null,null,null,{"$f":"VLOOKUP(B758,Certifications!$A$2:$D$844,4,FALSE)","v":{"$error":"#N/A"}}]
[758,null,null,null,null,null,null,{"$f":"VLOOKUP(B759,Certifications!$A$2:$D$844,4,FALSE)","v":{"$error":"#N/A"}}]
[759,null,null,null,null,null,null,{"$f":"VLOOKUP(B760,Certifications!$A$2:$D$844,4,FALSE)","v":{"$error":"#N/A"}}]
[760,null,null,null,null,null,null,{"$f":"VLOOKUP(B761,Certifications!$A$2:$D$844,4,FALSE)","v":{"$error":"#N/A"}}]
[761,null,null,null,null,null,null,{"$f":"VLOOKUP(B762,Certifications!$A$2:$D$844,4,FALSE)","v":{"$error":"#N/A"}}]
[762,null,null,null,null,null,null,{"$f":"VLOOKUP(B763,Certifications!$A$2:$D$844,4,FALSE)","v":{"$error":"#N/A"}}]
[763,null,null,null,null,null,null,{"$f":"VLOOKUP(B764,Certifications!$A$2:$D$844,4,FALSE)","v":{"$error":"#N/A"}}]
[764,null,null,null,null,null,null,{"$f":"VLOOKUP(B765,Certifications!$A$2:$D$844,4,FALSE)","v":{"$error":"#N/A"}}]
[765,null,null,null,null,null,null,{"$f":"VLOOKUP(B766,Certifications!$A$2:$D$844,4,FALSE)","v":{"$error":"#N/A"}}]
[766,null,null,null,null,null,null,{"$f":"VLOOKUP(B767,Certifications!$A$2:$D$844,4,FALSE)","v":{"$error":"#N/A"}}]
[767,null,null,null,null,null,null,{"$f":"VLOOKUP(B768,Certifications!$A$2:$D$844,4,FALSE)","v":{"$error":"#N/A"}}]
[768,null,null,null,null,null,null,{"$f":"VLOOKUP(B769,Certifications!$A$2:$D$844,4,FALSE)","v":{"$error":"#N/A"}}]
[769,null,null,null,null,null,null,{"$f":"VLOOKUP(B770,Certifications!$A$2:$D$844,4,FALSE)","v":{"$error":"#N/A"}}]
[770,null,null,null,null,null,null,{"$f":"VLOOKUP(B771,Certifications!$A$2:$D$844,4,FALSE)","v":{"$error":"#N/A"}}]
[771,null,null,null,null,null,null,{"$f":"VLOOKUP(B772,Certifications!$A$2:$D$844,4,FALSE)","v":{"$error":"#N/A"}}]
[772,null,null,null,null,null,null,{"$f":"VLOOKUP(B773,Certifications!$A$2:$D$844,4,FALSE)","v":{"$error":"#N/A"}}]
[773,null,null,null,null,null,null,{"$f":"VLOOKUP(B774,Certifications!$A$2:$D$844,4,FALSE)","v":{"$error":"#N/A"}}]
[774,null,null,null,null,null,null,{"$f":"VLOOKUP(B775,Certifications!$A$2:$D$844,4,FALSE)","v":{"$error":"#N/A"}}]
[775,null,null,null,null,null,null,{"$f":"VLOOKUP(B776,Certifications!$A$2:$D$844,4,FALSE)","v":{"$error":"#N/A"}}]
[776,null,null,null,null,null,null,{"$f":"VLOOKUP(B777,Certifications!$A$2:$D$844,4,FALSE)","v":{"$error":"#N/A"}}]
[777,null,null,null,null,null,null,{"$f":"VLOOKUP(B778,Certifications!$A$2:$D$844,4,FALSE)","v":{"$error":"#N/A"}}]
[778,null,null,null,null,null,null,{"$f":"VLOOKUP(B779,Certifications!$A$2:$D$844,4,FALSE)","v":{"$error":"#N/A"}}]
[779,null,null,null,null,null,null,{"$f":"VLOOKUP(B780,Certifications!$A$2:$D$844,4,FALSE)","v":{"$error":"#N/A"}}]
[780,null,null,null,null,null,null,{"$f":"VLOOKUP(B781,Certifications!$A$2:$D$844,4,FALSE)","v":{"$error":"#N/A"}}]
[781,null,null,null,null,null,null,{"$f":"VLOOKUP(B782,Certifications!$A$2:$D$844,4,FALSE)","v":{"$error":"#N/A"}}]
[782,null,null,null,null,null,null,{"$f":"VLOOKUP(B783,Certifications!$A$2:$D$844,4,FALSE)","v":{"$error":"#N/A"}}]
[783,null,null,null,null,null,null,{"$f":"VLOOKUP(B784,Certifications!$A$2:$D$844,4,FALSE)","v":{"$error":"#N/A"}}]
[784,null,null,null,null,null,null,{"$f":"VLOOKUP(B785,Certifications!$A$2:$D$844,4,FALSE)","v":{"$error":"#N/A"}}]
[785,null,null,null,null,null,null,{"$f":"VLOOKUP(B786,Certifications!$A$2:$D$844,4,FALSE)","v":{"$error":"#N/A"}}]
[786,null,null,null,null,null,null,{"$f":"VLOOKUP(B787,Certifications!$A$2:$D$844,4,FALSE)","v":{"$error":"#N/A"}}]
[787,null,null,null,null,null,null,{"$f":"VLOOKUP(B788,Certifications!$A$2:$D$844,4,FALSE)","v":{"$error":"#N/A"}}]
[788,null,null,null,null,null,null,{"$f":"VLOOKUP(B789,Certifications!$A$2:$D$844,4,FALSE)","v":{"$error":"#N/A"}}]
[789,null,null,null,null,null,null,{"$f":"VLOOKUP(B790,Certifications!$A$2:$D$844,4,FALSE)","v":{"$error":"#N/A"}}]
[790,null,null,null,null,null,null,{"$f":"VLOOKUP(B791,Certifications!$A$2:$D$844,4,FALSE)","v":{"$error":"#N/A"}}]
[791,null,null,null,null,null,null,{"$f":"VLOOKUP(B792,Certifications!$A$2:$D$844,4,FALSE)","v":{"$error":"#N/A"}}]
[792,null,null,null,null,null,null,{"$f":"VLOOKUP(B793,Certifications!$A$2:$D$844,4,FALSE)","v":{"$error":"#N/A"}}]
[793,null,null,null,null,null,null,{"$f":"VLOOKUP(B794,Certifications!$A$2:$D$844,4,FALSE)","v":{"$error":"#N/A"}}]
[794,null,null,null,null,null,null,{"$f":"VLOOKUP(B795,Certifications!$A$2:$D$844,4,FALSE)","v":{"$error":"#N/A"}}]
[795,null,null,null,null,null,null,{"$f":"VLOOKUP(B796,Certifications!$A$2:$D$844,4,FALSE)","v":{"$error":"#N/A"}}]
[796,null,null,null,null,null,null,{"$f":"VLOOKUP(B797,Certifications!$A$2:$D$844,4,FALSE)","v":{"$error":"#N/A"}}]
[797,null,null,null,null,null,null,{"$f":"VLOOKUP(B798,Certifications!$A$2:$D$844,4,FALSE)","v":{"$error":"#N/A"}}]
[798,null,null,null,null,null,null,{"$f":"VLOOKUP(B799,Certifications!$A$2:$D$844,4,FALSE)","v":{"$error":"#N/A"}}]
[799,null,null,null,null,null,null,{"$f":"VLOOKUP(B800,Certifications!$A$2:$D$844,4,FALSE)","v":{"$error":"#N/A"}}]
[800,null,null,null,null,null,null,{"$f":"VLOOKUP(B801,Certifications!$A$2:$D$844,4,FALSE)","v":{"$error":"#N/A"}}]
[null,null,null,null,null,null,null,{"$f":"VLOOKUP(B802,Certifications!$A$2:$D$844,4,FALSE)","v":{"$error":"#N/A"}}]
[null,null,null,null,null,null,null,{"$f":"VLOOKUP(B803,Certifications!$A$2:$D$844,4,FALSE)","v":{"$error":"#N/A"}}]
[null,null,null,null,null,null,null,{"$f":"VLOOKUP(B804,Certifications!$A$2:$D$844,4,FALSE)","v":{"$error":"#N/A"}}]
[null,null,null,null,null,null,null,{"$f":"VLOOKUP(B805,Certifications!$A$2:$D$844,4,FALSE)","v":{"$error":"#N/A"}}]
[null,null,null,null,null,null,null,{"$f":"VLOOKUP(B806,Certifications!$A$2:$D$844,4,FALSE)","v":{"$error":"#N/A"}}]
[null,null,null,null,null,null,null,{"$f":"VLOOKUP(B807,Certifications!$A$2:$D$844,4,FALSE)","v":{"$error":"#N/A"}}]
[null,null,null,null,null,null,null,{"$f":"VLOOKUP(B808,Certifications!$A$2:$D$844,4,FALSE)","v":{"$error":"#N/A"}}]
[null,null,null,null,null,null,null,{"$f":"VLOOKUP(B809,Certifications!$A$2:$D$844,4,FALSE)","v":{"$error":"#N/A"}}]
[null,null,null,null,null,null,null,{"$f":"VLOOKUP(B810,Certifications!$A$2:$D$844,4,FALSE)","v":{"$error":"#N/A"}}]
[null,null,null,null,null,null,null,{"$f":"VLOOKUP(B811,Certifications!$A$2:$D$844,4,FALSE)","v":{"$error":"#N/A"}}]
[null,null,null,null,null,null,null,{"$f":"VLOOKUP(B812,Certifications!$A$2:$D$844,4,FALSE)","v":{"$error":"#N/A"}}]
[null,null,null,null,null,null,null,{"$f":"VLOOKUP(B813,Certifications!$A$2:$D$844,4,FALSE)","v":{"$error":"#N/A"}}]
[null,null,null,null,null,null,null,{"$f":"VLOOKUP(B814,Certifications!$A$2:$D$844,4,FALSE)","v":{"$error":"#N/A"}}]
[null,null,null,null,null,null,null,{"$f":"VLOOKUP(B815,Certifications!$A$2:$D$844,4,FALSE)","v":{"$error":"#N/A"}}]
[null,null,null,null,null,null,null,{"$f":"VLOOKUP(B816,Certifications!$A$2:$D$844,4,FALSE)","v":{"$error":"#N/A"}}]
[null,null,null,null,null,null,null,{"$f":"VLOOKUP(B817,Certifications!$A$2:$D$844,4,FALSE)","v":{"$error":"#N/A"}}]
[null,null,null,null,null,null,null,{"$f":"VLOOKUP(B818,Certifications!$A$2:$D$844,4,FALSE)","v":{"$error":"#N/A"}}]
[null,null,null,null,null,null,null,{"$f":"VLOOKUP(B819,Certifications!$A$2:$D$844,4,FALSE)","v":{"$error":"#N/A"}}]
[null,null,null,null,null,null,null,{"$f":"VLOOKUP(B820,Certifications!$A$2:$D$844,4,FALSE)","v":{"$error":"#N/A"}}]
[null,null,null,null,null,null,null,{"$f":"VLOOKUP(B821,Certifications!$A$2:$D$844,4,FALSE)","v":{"$error":"#N/A"}}]
[null,null,null,null,null,null,null,{"$f":"VLOOKUP(B822,Certifications!$A$2:$D$844,4,FALSE)","v":{"$error":"#N/A"}}]
[null,null,null,null,null,null,null,{"$f":"VLOOKUP(B823,Certifications!$A$2:$D$844,4,FALSE)","v":{"$error":"#N/A"}}]
[null,null,null,null,null,null,null,{"$f":"VLOOKUP(B824,Certifications!$A$2:$D$844,4,FALSE)","v":{"$error":"#N/A"}}]
[null,null,null,null,null,null,null,{"$f":"VLOOKUP(B825,Certifications!$A$2:$D$844,4,FALSE)","v":{"$error":"#N/A"}}]
[null,null,null,null,null,null,null,{"$f":"VLOOKUP(B826,Certifications!$A$2:$D$844,4,FALSE)","v":{"$error":"#N/A"}}]
[null,null,null,null,null,null,null,{"$f":"VLOOKUP(B827,Certifications!$A$2:$D$844,4,FALSE)","v":{"$error":"#N/A"}}]
[null,null,null,null,null,null,null,{"$f":"VLOOKUP(B828,Certifications!$A$2:$D$844,4,FALSE)","v":{"$error":"#N/A"}}]
[null,null,null,null,null,null,null,{"$f":"VLOOKUP(B829,Certifications!$A$2:$D$844,4,FALSE)","v":{"$error":"#N/A"}}]
[null,null,null,null,null,null,null,{"$f":"VLOOKUP(B830,Certifications!$A$2:$D$844,4,FALSE)","v":{"$error":"#N/A"}}]
[null,null,null,null,null,null,null,{"$f":"VLOOKUP(B831,Certifications!$A$2:$D$844,4,FALSE)","v":{"$error":"#N/A"}}]
[null,null,null,null,null,null,null,{"$f":"VLOOKUP(B832,Certifications!$A$2:$D$844,4,FALSE)","v":{"$error":"#N/A"}}]
[null,null,null,null,null,null,null,{"$f":"VLOOKUP(B833,Certifications!$A$2:$D$844,4,FALSE)","v":{"$error":"#N/A"}}]
[null,null,null,null,null,null,null,{"$f":"VLOOKUP(B834,Certifications!$A$2:$D$844,4,FALSE)","v":{"$error":"#N/A"}}]
[null,null,null,null,null,null,null,{"$f":"VLOOKUP(B835,Certifications!$A$2:$D$844,4,FALSE)","v":{"$error":"#N/A"}}]
[null,null,null,null,null,null,null,{"$f":"VLOOKUP(B836,Certifications!$A$2:$D$844,4,FALSE)","v":{"$error":"#N/A"}}]

{"sheet":"1920 PSICFL","index":4,"n_rows":273,"n_cols":6,"rows_kept":273,"cut":false,"hidden":true,"merged":[]}
["DOE Code","PSICFL","Eligible for College Performance Incentive Funds2","College Performance Funding Area","Eligible for District Performance Incentive Funds3","District Performance Funding Area"]
["AAMIN001","Yes","Yes","Health Sciences","No"]
["ABAYC001","Yes","Yes","Advanced manufacturing","Yes","Advanced manufacturing"]
["ABAYC003","Yes","Yes","Electrician","Yes","Electrician"]
["ABAYC006","Yes","Yes","Heating, ventilation and air conditioning technician","Yes","Heating, ventilation and air conditioning technician"]
["ABCOP001","Yes","Yes","Health Sciences","No"]
["ACOPC004","Yes","Yes","Health Sciences","Yes","Health Sciences - Medical coder/biller"]
["ACOPC005","Yes","Yes","Health Sciences","Yes","Health Sciences - Medical coder/biller"]
["ACOPC006","Yes","Yes","Health Sciences","Yes","Health Sciences - Medical coder/biller"]
["ACOPC007","Yes","Yes","Health Sciences","Yes","Health Sciences - Medical coder/biller"]
["ACSMD002","Yes","Yes","Health Sciences","No"]
["ADESK021","Yes","No",null,"Yes","Computer-aided drafting"]
["ADESK023","Yes","No",null,"Yes","Computer-aided drafting"]
["ADESK024","Yes","No",null,"Yes","Computer-aided drafting"]
["ADESK025","Yes","No",null,"Yes","Computer-aided drafting"]
["AFHDI001","Yes","Yes","Health Sciences","No"]
["AFHDI002","Yes","Yes","Health Sciences","No"]
["AHIMA001","Yes","Yes","Health Sciences","Yes","Health Sciences - Medical coder/biller"]
["AHIMA002","Yes","Yes","Health Sciences","Yes","Health Sciences - Medical coder/biller"]
["AHIMA003","Yes","Yes","Health Sciences","Yes","Health Sciences - Medical coder/biller"]
["AHIMA007","Yes","Yes","Health Sciences","No"]
["AHIMA009","Yes","Yes","Health Sciences","No"]
["AHIMA010","Yes","Yes","Health Sciences","No"]
["AHIMA011","Yes","Yes","Health Sciences","No"]
["AHIMA012","Yes","Yes","Health Sciences","No"]
["AHIMA013","Yes","Yes","Health Sciences","No"]
["AHIMA014","Yes","Yes","Health Sciences","No"]
["AHIMA015","Yes","Yes","Health Sciences","No"]
["AHIMA016","Yes","Yes","Health Sciences","No"]
["AHIMA017","Yes","Yes","Health Sciences","No"]
["AHIMA018","Yes","Yes","Health Sciences","No"]
["AMAMA001","Yes","Yes","Health Sciences","Yes","Health Sciences - Medical assisting"]
["AMAOB001","Yes","Yes","Health Sciences","Yes","Health Sciences - Clinical lab technician"]
["AMAZN001","Yes","Yes","Cloud virtualization","Yes","Cloud virtualization"]
["AMAZN002","Yes","Yes","Cloud virtualization","Yes","Cloud virtualization"]
["AMDDA003","Yes","No",null,"Yes","Computer-aided drafting"]
["AMDDA004","Yes","No",null,"Yes","Computer-aided drafting"]
["AMEDT002","Yes","Yes","Health Sciences","Yes","Health Sciences - Clinical lab technician"]
["AMEDT004","Yes","Yes","Health Sciences","Yes","Health Sciences - Medical assisting"]
["AMOPT001","Yes","Yes","Health Sciences","No"]
["AMRRT002","Yes","Yes","Health Sciences","No"]
["AMRRT003","Yes","Yes","Health Sciences","No"]
["AMRRT005","Yes","Yes","Health Sciences","No"]
["AMRRT006","Yes","Yes","Health Sciences","No"]
["AMRRT007","Yes","Yes","Health Sciences","No"]
["AMRRT008","Yes","Yes","Health Sciences","No"]
["AMSCP001","Yes","Yes","Health Sciences","No"]
["AMSCP002","Yes","Yes","Health Sciences","No"]
["AMSFQ001","Yes","Yes","Advanced manufacturing","Yes","Advanced manufacturing"]
["AMSFQ006","Yes","Yes","Advanced manufacturing","Yes","Advanced manufacturing"]
["AMSFQ011","Yes","Yes","Advanced manufacturing","Yes","Advanced manufacturing"]
["AMSFQ012","Yes","Yes","Advanced manufacturing","Yes","Advanced manufacturing"]
["AMSTL004","Yes","Yes","Advanced manufacturing","Yes","Advanced manufacturing"]
["APICS001","Yes","Yes","Advanced Manufacturing","Yes","Advanced Manufacturing"]
["ARDMS001","Yes","Yes","Health Sciences","No"]
["ARDMS002","Yes","Yes","Health Sciences","No"]
["ARDMS003","Yes","Yes","Health Sciences","No"]
["AWELD003","Yes","Yes","Welding","Yes","Welding"]
["AWELD004","Yes","Yes","Welding","Yes","Welding"]
["AWELD005","Yes","Yes","Welding","Yes","Welding"]
["AWELD006","Yes","Yes","Welding","Yes","Welding"]
["AWELD007","Yes","Yes","Welding","Yes","Welding"]
["AWELD008","Yes","Yes","Welding","Yes","Welding"]
["AWELD009","Yes","Yes","Welding","Yes","Welding"]
["AWELD010","Yes","Yes","Welding","Yes","Welding"]
["AWELD011","Yes","Yes","Welding","Yes","Welding"]
["AWELD012","Yes","Yes","Welding","Yes","Welding"]
["BNENT001","Yes","Yes","Health Sciences","Yes","Health Sciences - Clinical hemodialysis technician"]
["CCINT002","Yes","Yes","Health Sciences","No"]
["CCINT003","Yes","Yes","Health Sciences","No"]
["CCINT004","Yes","Yes","Health Sciences","No"]
["CDREG001","Yes","Yes","Health Sciences","No"]
["CISCO001","Yes","Yes","Network support services","Yes","Network support services"]
["CISCO002","Yes","Yes","Network support services","Yes","Network support services"]
["CISCO004","Yes","Yes","Network support services","Yes","Network support services"]
["CISCO005","Yes","Yes","Network support services","Yes","Network support services"]
["CISCO009","Yes","Yes","Network support services","Yes","Network support services"]
["CISCO010","Yes","Yes","Network support services","Yes","Network support services"]
["CISCO011","Yes","Yes","Cybersecurity","Yes","Cybersecurity"]
["CISCO013","Yes","Yes","Network support services","Yes","Network support services"]
["CISCO017","Yes","Yes","Network support services","Yes","Network support services"]
["CISCO018","Yes","Yes","Network support services","Yes","Network support services"]
["CISCO019","Yes","Yes","Cybersecurity","Yes","Cybersecurity"]
["CISCO024","Yes","Yes","Network support services","Yes","Network support services"]
["CISCO025","Yes","Yes","Cybersecurity","Yes","Cybersecurity"]
["CITRX004","Yes","Yes","Network support services","Yes","Network support services"]
["CNCSI001","Yes","Yes","Advanced manufacturing","Yes","Advanced manufacturing"]
["CNCSI002","Yes","Yes","Advanced manufacturing","Yes","Advanced manufacturing"]
["COMPT001","Yes","Yes","Network support services","Yes","Network support services"]
["COMPT005","Yes","Yes","Network support services","Yes","Network support services"]
["COMPT006","Yes","Yes","Network support services","Yes","Network support services"]
["COMPT007","Yes","Yes","Network support services","Yes","Network support services"]
["COMPT008","Yes","Yes","Cybersecurity","Yes","Cybersecurity"]
["COMPT009","Yes","Yes","Network support services","Yes","Network support services"]
["COMPT014","Yes","Yes","Cloud virtualization","Yes","Cloud virtualization"]
["COMPT016","Yes","Yes","Cybersecurity","Yes","Cybersecurity"]
["COMPT017","Yes","Yes","Cybersecurity","Yes","Cybersecurity"]
["COMPT019","Yes","Yes","Cyber Security","Yes","Cyber Security"]
["CPSTL001","Yes","Yes","Cybersecurity","Yes","Cybersecurity"]
["CPSTL002","Yes","Yes","Cybersecurity","Yes","Cybersecurity"]
["CSCMP001","Yes","Yes","Advanced Manufacturing","Yes","Advanced Manufacturing"]
["CWNPT001","Yes","Yes","Network support services","Yes","Network support services"]
["DANBD001","Yes","Yes","Health Sciences","Yes","Health Sciences - Dental assisting technology"]
["EMCSQ001","Yes","Yes","Network support services","Yes","Network support services"]
["ENTCP001","Yes","Yes","Electrician","Yes","Electrician"]
["ETAIN002","Yes","Yes","Network support services","Yes","Network support services"]
["ETAIN008","Yes","Yes","Network support services","Yes","Network support services"]
["ETAIN009","Yes","Yes","Network support services","Yes","Network support services"]
["ETAIN010","Yes","Yes","Network support services","Yes","Network support services"]
["ETAIN011","Yes","Yes","Network support services","Yes","Network support services"]
["ETAIN012","Yes","Yes","Network support services","Yes","Network support services"]
["ETAIN013","Yes","Yes","Network support services","Yes","Network support services"]
["ETAIN014","Yes","Yes","Network support services","Yes","Network support services"]
["ETAIN019","Yes","Yes","Network support services","Yes","Network support services"]
["ETAIN022","Yes","Yes","Network support services","Yes","Network support services"]
["ETAIN023","Yes","Yes","Network support services","Yes","Network support services"]
["FASMB001","Yes","Yes","Health Sciences","No"]
["FDMQA002","Yes","Yes","Health Sciences","Yes","Health Sciences - Certified nursing assistant"]
["FDMQA010","Yes","Yes","Health Sciences","No"]
["FDMQA014","Yes","Yes","Health Sciences","Yes","Health Sciences - Emergency medical technician and paramedic"]
["FDMQA018","Yes","Yes","Health Sciences","No"]
["FDMQA025","Yes","Yes","Health Sciences","No"]
["FDMQA030","Yes","Yes","Public safety","Yes","Public safety"]
["FEDAA002","Yes","Yes","Federal Aviation Administration airframe mechanics","Yes","Federal Aviation Administration airframe mechanics"]
["FEDAA004","Yes","Yes","Federal Aviation Administration airframe mechanics","Yes","Federal Aviation Administration airframe mechanics"]
["FEDAA010","Yes","Yes","Federal Aviation Administration power plant mechanics","Yes","Federal Aviation Administration power plant mechanics"]
["FLDLE002","Yes","Yes","Public safety","Yes","Public safety"]
["FLDLE003","Yes","Yes","Public safety","Yes","Public safety"]
["FLDLE004","Yes","Yes","Public safety","Yes","Public safety"]
["FLSFM006","Yes","Yes","Public safety","Yes","Public safety"]
["FLSFM007","Yes","Yes","Public safety","Yes","Public safety"]
["FLSFM014","Yes","Yes","Public Safety","Yes","Public Safety"]
["GLIAC001","Yes","Yes","Cybersecurity","Yes","Cybersecurity"]
["GLIAC002","Yes","Yes","Cybersecurity","Yes","Cybersecurity"]
["GLIAC003","Yes","Yes","Cybersecurity","Yes","Cybersecurity"]
["GLIAC004","Yes","Yes","Cybersecurity","Yes","Cybersecurity"]
["GLIAC005","Yes","Yes","Cybersecurity","Yes","Cybersecurity"]
["HIMSS001","Yes","Yes","Health Sciences","No"]
["HVACE001","Yes","Yes","Heating, ventilation and air conditioning technician","Yes","Heating, ventilation and air conditioning technician"]
["HVACE002","Yes","Yes","Heating, ventilation and air conditioning technician","Yes","Heating, ventilation and air conditioning technician"]
["HVACE003","Yes","Yes","Heating, ventilation and air conditioning technician","Yes","Heating, ventilation and air conditioning technician"]
["HVACE004","Yes","Yes","Heating, ventilation and air conditioning technician","Yes","Heating, ventilation and air conditioning technician"]
["HVACE005","Yes","Yes","Heating, ventilation and air conditioning technician","Yes","Heating, ventilation and air conditioning technician"]
["HVACE006","Yes","Yes","Heating, ventilation and air conditioning technician","Yes","Heating, ventilation and air conditioning technician"]
["HVACE011","Yes","Yes","Heating, ventilation and air conditioning technician","Yes","Heating, ventilation and air conditioning technician"]
["IASSC001","Yes","Yes","Advanced Manufacturing","Yes","Advanced Manufacturing"]
["ICOEC002","Yes","Yes","Cybersecurity","Yes","Cybersecurity"]
["ICOEC003","Yes","Yes","Cybersecurity","Yes","Cybersecurity"]
["ICOEC004","Yes","Yes","Cybersecurity","Yes","Cybersecurity"]
["IECON001","Yes","Yes","Electrician","Yes","Electrician"]
["IECON002","Yes","Yes","Electrician","Yes","Electrician"]
["IECON003","Yes","Yes","Electrician","Yes","Electrician"]
["IECON004","Yes","Yes","Electrician","Yes","Electrician"]
["IHKBZ001","Yes","Yes","Advanced manufacturing","Yes","Advanced manufacturing"]
["IISSC001","Yes","Yes","Cybersecurity","Yes","Cybersecurity"]
["IISSC002","Yes","Yes","Cybersecurity","Yes","Cybersecurity"]
["IISSC003","Yes","Yes","Cybersecurity","Yes","Cybersecurity"]
["IISSC004","Yes","Yes","Cybersecurity","Yes","Cybersecurity"]
["INSOC002","Yes","Yes","Advanced manufacturing","Yes","Advanced manufacturing"]
["INSOC005","Yes","Yes","Advanced manufacturing","Yes","Advanced manufacturing"]
["ISCET002","Yes","Yes","Electrician","Yes","Electrician"]
["JCAHO001","Yes","Yes","Health Sciences","No"]
["JCAHO002","Yes","Yes","Health Sciences","No"]
["MANSI001","Yes","Yes","Advanced manufacturing","Yes","Advanced manufacturing"]
["MICRO052","Yes","Yes","Network support services","Yes","Network support services"]
["MICRO082","Yes","Yes","Network support services","Yes","Network support services"]
["MICRO085","Yes","Yes","Network support services","Yes","Network support services"]
["MICRO086","Yes","Yes","Network support services","Yes","Network support services"]
["MICRO106","Yes","Yes","Network support services","Yes","Network support services"]
["MICRO107","Yes","Yes","Network support services","Yes","Network support services"]
["MICRO108","Yes","Yes","Network support services","Yes","Network support services"]
["MICRO109","Yes","Yes","Cloud virtualization","Yes","Cloud virtualization"]
["MICRO110","Yes","Yes","Network support services","Yes","Network support services"]
["MICRO111","Yes","Yes","Computer Programming","Yes","Computer Programming"]
["MSSCN001","Yes","Yes","Advanced manufacturing","Yes","Advanced manufacturing"]
["MSSCN002","Yes","Yes","Advanced manufacturing","Yes","Advanced manufacturing"]
["NASME001","Yes","Yes","Health Sciences","No"]
["NATEX001","Yes","Yes","Heating, ventilation and air conditioning technician","Yes","Heating, ventilation and air conditioning technician"]
["NATEX002","Yes","Yes","Heating, ventilation and air conditioning technician","Yes","Heating, ventilation and air conditioning technician"]
["NATEX003","Yes","Yes","Heating, ventilation and air conditioning technician","Yes","Heating, ventilation and air conditioning technician"]
["NATEX004","Yes","Yes","Heating, ventilation and air conditioning technician","Yes","Heating, ventilation and air conditioning technician"]
["NATHA002","Yes","Yes","Health Sciences","Yes","Health Sciences - EKG technician"]
["NATHA006","Yes","Yes","Health Sciences","Yes","Health Sciences - Medical assisting"]
["NATHA008","Yes","Yes","Health Sciences","Yes","Health Sciences - Medical coder/biller"]
["NATHA009","Yes","Yes","Health Sciences","Yes","Health Sciences - Medical assisting"]
["NATHA010","Yes","Yes","Health Sciences - Pharmacy technician","Yes","Health Sciences - Pharmacy technician"]
["NBCOT001","Yes","Yes","Health Sciences","Yes","Health Sciences - Orthopedic technology"]
["NBFOT001","Yes","Yes","Health Sciences","No"]
["NBFRC001","Yes","Yes","Health Sciences","No"]
["NBFRC002","Yes","Yes","Health Sciences","No"]
["NCATT001","Yes","Yes","Federal Aviation Administration airframe mechanics","Yes","Federal Aviation Administration airframe mechanics"]
["NCCER211","Yes","Yes","Electrician","Yes","Electrician"]
["NCCER222","Yes","Yes","Heating, ventilation and air conditioning technician","Yes","Heating, ventilation and air conditioning technician"]
["NCCER249","Yes","No",null,"Yes","Plumbing"]
["NCCER253","Yes","No",null,"Yes","Plumbing"]
["NCCER265","Yes","Yes","Welding","Yes","Welding"]
["NCCER267","Yes","Yes","Advanced manufacturing","Yes","Advanced manufacturing"]
["NCFCT004","Yes","No",null,"Yes","Health Sciences - Surgical technology"]
["NCFCT005","Yes","No",null,"Yes","Health Sciences - Medical assisting"]
["NCSAF001","Yes","Yes","Health Sciences","No"]
["NCSAF002","Yes","Yes","Health Sciences","No"]
["NCSAF003","Yes","Yes","Health Sciences","No"]
["NCSBN001","Yes","Yes","Health Sciences","No"]
["NCSBN002","Yes","Yes","Health Sciences","Yes","Health Sciences - Practical nursing"]
["NIASE001","Yes","Yes","Automotive service technology","Yes","Automotive service technology"]
["NIASE005","Yes","Yes","Automotive service technology","Yes","Automotive service technology"]
["NIASE007","Yes","Yes","Automotive service technology","Yes","Automotive service technology"]
["NIASE008","Yes","Yes","Automotive service technology","Yes","Automotive service technology"]
["NIASE009","Yes","Yes","Automotive service technology","Yes","Automotive service technology"]
["NIASE010","Yes","Yes","Automotive service technology","Yes","Automotive service technology"]
["NIASE011","Yes","Yes","Automotive service technology","Yes","Automotive service technology"]
["NIASE012","Yes","Yes","Automotive service technology","Yes","Automotive service technology"]
["NIASE014","Yes","Yes","Automotive service technology","Yes","Automotive service technology"]
["NIASE016","Yes","No",null,"Yes","Medium/heavy duty truck technician"]
["NIASE017","Yes","Yes","Auto collision repair and refinishing","Yes","Auto collision repair and refinishing"]
["NIASE018","Yes","Yes","Auto collision repair and refinishing","Yes","Auto collision repair and refinishing"]
["NIASE020","Yes","No",null,"Yes","Medium/heavy duty truck technician"]
["NIASE021","Yes","No",null,"Yes","Medium/heavy duty truck technician"]
["NIASE023","Yes","No",null,"Yes","Medium/heavy duty truck technician"]
["NIASE025","Yes","No",null,"Yes","Medium/heavy duty truck technician"]
["NIASE026","Yes","No",null,"Yes","Medium/heavy duty truck technician"]
["NIASE029","Yes","Yes","Auto collision repair and refinishing","Yes","Auto collision repair and refinishing"]
["NIASE031","Yes","No",null,"Yes","Medium/heavy duty truck technician"]
["NIASE032","Yes","Yes","Auto collision repair and refinishing","Yes","Auto collision repair and refinishing"]
["NIASE033","Yes","No",null,"Yes","Medium/heavy duty truck technician"]
["NIASE053","Yes","No",null,"Yes","Medium/heavy duty truck technician"]
["NIASE054","Yes","No",null,"Yes","Medium/heavy duty truck technician"]
["NIASE055","Yes","No",null,"Yes","Medium/heavy duty truck technician"]
["NIASE056","Yes","No",null,"Yes","Medium/heavy duty truck technician"]
["NIASE057","Yes","No",null,"Yes","Medium/heavy duty truck technician"]
["NIASE058","Yes","No",null,"Yes","Medium/heavy duty truck technician"]
["NIASE059","Yes","No",null,"Yes","Medium/heavy duty truck technician"]
["NIASE060","Yes","No",null,"Yes","Medium/heavy duty truck technician"]
["NIASE061","Yes","Yes","Automotive service technology","Yes","Automotive service technology"]
["NIASE071","Yes","Yes","Automotive service technology","Yes","Automotive service technology"]
["NIFMS003","Yes","Yes","Advanced manufacturing","Yes","Advanced manufacturing"]
["NIFMS004","Yes","Yes","Advanced manufacturing","Yes","Advanced manufacturing"]
["NIFMS007","Yes","Yes","Advanced manufacturing","Yes","Advanced manufacturing"]
["NIFMS012","Yes","Yes","Advanced manufacturing","Yes","Advanced manufacturing"]
["NIFMS018","Yes","Yes","Advanced manufacturing","Yes","Advanced manufacturing"]
["NIFMS019","Yes","Yes","Advanced manufacturing","Yes","Advanced manufacturing"]
["NIFMS020","Yes","Yes","Advanced manufacturing","Yes","Advanced manufacturing"]
["NIFMS021","Yes","Yes","Advanced Manufacturing","Yes","Advanced Manufacturing"]
["NJATC001","Yes","Yes","Electrician","Yes","Electrician"]
["NMTCB001","Yes","Yes","Health Sciences","No"]
["NMTCB002","Yes","Yes","Health Sciences","No"]
["NNCCO001","Yes","Yes","Health Sciences","Yes","Health Sciences - Clinical hemodialysis technician"]
["NREMT001","Yes","Yes","Health Sciences","Yes","Health Sciences - Emergency medical technician and paramedic"]
["NSTSA001","Yes","Yes","Health Sciences","Yes","Health Sciences - Surgical technology"]
["NSTSA002","Yes","Yes","Health Sciences","No"]
["ORACL001","Yes","Yes","Network support services","Yes","Network support services"]
["ORACL002","Yes","Yes","Network support services","Yes","Network support services"]
["ORACL003","Yes","Yes","Network support services","Yes","Network support services"]
["ORACL004","Yes","Yes","Computer programming","Yes","Computer programming"]
["ORACL005","Yes","Yes","Computer programming","Yes","Computer programming"]
["ORACL006","Yes","Yes","Computer programming","Yes","Computer programming"]
["PROSO003","Yes","Yes","Network support services","Yes","Network support services"]
["PROSO006","Yes","Yes","Network support services","Yes","Network support services"]
["PROSO010","Yes","Yes","Cybersecurity","Yes","Cybersecurity"]
["PROSO017","Yes","Yes","Computer programming","Yes","Computer programming"]
["PROSO019","Yes","Yes","Computer programming","Yes","Computer programming"]
["PROSO021","Yes","Yes","Computer programming","Yes","Computer programming"]
["PROSO022","Yes","Yes","Computer programming","Yes","Computer programming"]
["PROSO023","Yes","Yes","Computer programming","Yes","Computer programming"]
["PROSO026","Yes","Yes","Cybersecurity","Yes","Cybersecurity"]
["PROSO027","Yes","Yes","Computer programming","Yes","Computer programming"]
["PTCBD001","Yes","Yes","Health Sciences - Pharmacy technician","Yes","Health Sciences - Pharmacy technician"]
["SMFEN001","Yes","Yes","Advanced manufacturing","Yes","Advanced manufacturing"]
["SMRPR001","Yes","Yes","Advanced manufacturing","Yes","Advanced manufacturing"]
["SOLID004","Yes","Yes","Advanced manufacturing","Yes","Advanced manufacturing"]
["SPACE001","Yes","Yes","Advanced manufacturing","Yes","Advanced manufacturing"]
["TAFOM001","Yes","Yes","Advanced manufacturing","Yes","Advanced manufacturing"]
["VMWRE004","Yes","Yes","Cloud virtualization","Yes","Cloud virtualization"]

{"sheet":"Codes Master","index":5,"n_rows":916,"n_cols":11,"rows_kept":916,"cut":false,"hidden":true,"merged":[]}
[null,"Cert_Code","Form Lookup Box","Cert_Title","Status",null,"Cert_Agency_Name","PSICFL","PSICFL FE District","PSICFL FE College"]
[1,"AAMIN001",{"$f":"CONCATENATE(\"(\",B2,\") \",D2)","v":"(AAMIN001) Certified Biomedical Equipment Technician"},"Certified Biomedical Equipment Technician",{"$f":"IF(H2=\"no\",\"1\",IF(AND(H2=\"Yes\",I2=\"No\",J2=\"No\"),\"3\",IF(AND(H2=\"Yes\",I2=\"Yes\",J2=\"Yes\"),\"2\",IF(AND(H2=\"Yes\",I2=\"Yes\",J2=\"No\"),\"5\",IF(AND(H2=\"Yes\",I2=\"No\",J2=\"Yes\"),\"4\",\"0\")))))","v":"4"},1,"Association for the Advancement of Medical Instrumentation (AAMI)",{"$f":"IFERROR(VLOOKUP(B2,PSICFL_1819a,2,FALSE),\"No\")","v":"Yes"},{"$f":"IFERROR(VLOOKUP(B2,PSICFL_1819a,5,FALSE),\"No\")","v":"No"},{"$f":"IFERROR(VLOOKUP(B2,PSICFL_1819a,3,FALSE),\"No\")","v":"Yes"},{"$f":"VLOOKUP(B2,'DOE Codes Lookups'!$A$3:$D$507,2,FALSE)","v":{"$error":"#N/A"}}]
[2,"AAVSB001","(AAVSB001) Veterinary Technician","Veterinary Technician","1",2,"American Association of Veterinary State Boards","No","No","No",{"$f":"VLOOKUP(B3,'DOE Codes Lookups'!$A$3:$D$507,2,FALSE)","v":{"$error":"#N/A"}}]
[3,"ABAYC001","(ABAYC001) Composite Boat Builder Certification","Composite Boat Builder Certification","2",3,"American Boat & Yacht Council","Yes","Yes","Yes",{"$f":"VLOOKUP(B4,'DOE Codes Lookups'!$A$3:$D$507,2,FALSE)","v":{"$error":"#N/A"}}]
[4,"ABAYC002","(ABAYC002) Marine Diesel Certification","Marine Diesel Certification","1",4,"American Boat & Yacht Council","No","No","No",{"$f":"VLOOKUP(B5,'DOE Codes Lookups'!$A$3:$D$507,2,FALSE)","v":{"$error":"#N/A"}}]
[5,"ABAYC003","(ABAYC003) Marine Electrical Certification","Marine Electrical Certification","2",5,"American Boat & Yacht Council","Yes","Yes","Yes",{"$f":"VLOOKUP(B6,'DOE Codes Lookups'!$A$3:$D$507,2,FALSE)","v":{"$error":"#N/A"}}]
[6,"ABAYC005","(ABAYC005) Marine Systems Certification","Marine Systems Certification","1",6,"American Boat & Yacht Council","No","No","No",{"$f":"VLOOKUP(B7,'DOE Codes Lookups'!$A$3:$D$507,2,FALSE)","v":{"$error":"#N/A"}}]
[7,"ABAYC006","(ABAYC006) A/C Refrigeration Certification","A/C Refrigeration Certification","2",7,"American Boat & Yacht Council","Yes","Yes","Yes",{"$f":"VLOOKUP(B8,'DOE Codes Lookups'!$A$3:$D$507,2,FALSE)","v":{"$error":"#N/A"}}]
[8,"ABAYC007","(ABAYC007) Marine Corrosion Certification","Marine Corrosion Certification","1",8,"American Boat & Yacht Council","No","No","No",{"$f":"VLOOKUP(B9,'DOE Codes Lookups'!$A$3:$D$507,2,FALSE)","v":{"$error":"#N/A"}}]
[9,"ABCOP001","(ABCOP001) Certified Prosthetic (and/or) Orthotic Technician (CTPO)","Certified Prosthetic (and/or) Orthotic Technician (CTPO)","4",9,"American Board for Certification in Orthotics, Prosthetics & Pedorthics","Yes","No","Yes",{"$f":"VLOOKUP(B10,'DOE Codes Lookups'!$A$3:$D$507,2,FALSE)","v":{"$error":"#N/A"}}]
[10,"ABRET001","(ABRET001) Registered EEG Technologist (R. EEG T.)","Registered EEG Technologist (R. EEG T.)","1",10,"American Board of Registration of Electroencephalographic and Evoked Potential Technologists","No","No","No",{"$f":"VLOOKUP(B11,'DOE Codes Lookups'!$A$3:$D$507,2,FALSE)","v":{"$error":"#N/A"}}]
[11,"ACFAT001","(ACFAT001) Accredited Business Accountant (ABA)","Accredited Business Accountant (ABA)","1",11,"Accreditation Council for Accountancy & Taxation","No","No","No",{"$f":"VLOOKUP(B12,'DOE Codes Lookups'!$A$3:$D$507,2,FALSE)","v":{"$error":"#N/A"}}]
[12,"ACFED001","(ACFED001) Certified Chef de Cuisine","Certified Chef de Cuisine","1",12,"American Culinary Federation","No","No","No",{"$f":"VLOOKUP(B13,'DOE Codes Lookups'!$A$3:$D$507,2,FALSE)","v":{"$error":"#N/A"}}]
[13,"ACFED002","(ACFED002) Certified Culinarian (CC)","Certified Culinarian (CC)","1",13,"American Culinary Federation","No","No","No",{"$f":"VLOOKUP(B14,'DOE Codes Lookups'!$A$3:$D$507,2,FALSE)","v":{"$error":"#N/A"}}]
[14,"ACFED006","(ACFED006) Certified Fundamentals Cook","Certified Fundamentals Cook","1",14,"American Culinary Federation","No","No","No",{"$f":"VLOOKUP(B15,'DOE Codes Lookups'!$A$3:$D$507,2,FALSE)","v":{"$error":"#N/A"}}]
[15,"ACOPC001","(ACOPC001) Certified Professional Coder (CPC - Apprentice)","Certified Professional Coder (CPC - Apprentice)","1",15,"American Academy of Professional Coders","No","No","No",{"$f":"VLOOKUP(B16,'DOE Codes Lookups'!$A$3:$D$507,2,FALSE)","v":{"$error":"#N/A"}}]
[16,"ACOPC004","(ACOPC004) Certified Outpatient Coder (COC)","Certified Outpatient Coder (COC)","2",16,"American Academy of Professional Coders","Yes","Yes","Yes",{"$f":"VLOOKUP(B17,'DOE Codes Lookups'!$A$3:$D$507,2,FALSE)","v":{"$error":"#N/A"}}]
[17,"ACOPC005","(ACOPC005) Certified Professional Coder - Payer (CPC-P)","Certified Professional Coder - Payer (CPC-P)","2",17,"American Academy of Professional Coders","Yes","Yes","Yes",{"$f":"VLOOKUP(B18,'DOE Codes Lookups'!$A$3:$D$507,2,FALSE)","v":{"$error":"#N/A"}}]
[18,"ACOPC006","(ACOPC006) Certified Professional Coder (CPC)","Certified Professional Coder (CPC)","2",18,"American Academy of Professional Coders","Yes","Yes","Yes",{"$f":"VLOOKUP(B19,'DOE Codes Lookups'!$A$3:$D$507,2,FALSE)","v":{"$error":"#N/A"}}]
[19,"ACOPC007","(ACOPC007) Certified Professional Biller (CPB)","Certified Professional Biller (CPB)","2",19,"American Academy of Professional Coders","Yes","Yes","Yes",{"$f":"VLOOKUP(B20,'DOE Codes Lookups'!$A$3:$D$507,2,FALSE)","v":{"$error":"#N/A"}}]
[20,"ACOSM001","(ACOSM001) Certified Survey Technician (CST)","Certified Survey Technician (CST)","1",20,"American Congress on Surveying and Mapping - National Society of Professional Surveyors","No","No","No",{"$f":"VLOOKUP(B21,'DOE Codes Lookups'!$A$3:$D$507,2,FALSE)","v":{"$error":"#N/A"}}]
[21,"ACSMD002","(ACSMD002) Certified Personal Trainer","Certified Personal Trainer","4",21,"American College of Sports Medicine","Yes","No","Yes",{"$f":"VLOOKUP(B22,'DOE Codes Lookups'!$A$3:$D$507,2,FALSE)","v":{"$error":"#N/A"}}]
[22,"ADESK002","(ADESK002) Autodesk Certified User - AutoCAD","Autodesk Certified User - AutoCAD","1",22,"Autodesk","No","No","No",{"$f":"VLOOKUP(B23,'DOE Codes Lookups'!$A$3:$D$507,2,FALSE)","v":{"$error":"#N/A"}}]
[23,"ADESK008","(ADESK008) Autodesk Certified User - Revit Architecture","Autodesk Certified User - Revit Architecture","1",23,"Autodesk","No","No","No",{"$f":"VLOOKUP(B24,'DOE Codes Lookups'!$A$3:$D$507,2,FALSE)","v":{"$error":"#N/A"}}]
[24,"ADESK011","(ADESK011) Autodesk Certified User - Inventor","Autodesk Certified User - Inventor","1",24,"Autodesk","No","No","No",{"$f":"VLOOKUP(B25,'DOE Codes Lookups'!$A$3:$D$507,2,FALSE)","v":{"$error":"#N/A"}}]
[25,"ADESK021","(ADESK021) Autodesk Certified Professional - AutoCAD","Autodesk Certified Professional - AutoCAD","5",25,"Autodesk","Yes","Yes","No",{"$f":"VLOOKUP(B26,'DOE Codes Lookups'!$A$3:$D$507,2,FALSE)","v":{"$error":"#N/A"}}]
[26,"ADESK023","(ADESK023) Autodesk Certified Professional - AutoCAD Civil 3D","Autodesk Certified Professional - AutoCAD Civil 3D","5",26,"Autodesk","Yes","Yes","No",{"$f":"VLOOKUP(B27,'DOE Codes Lookups'!$A$3:$D$507,2,FALSE)","v":{"$error":"#N/A"}}]
[27,"ADESK024","(ADESK024) Autodesk Certified Professional - Inventor","Autodesk Certified Professional - Inventor","5",27,"Autodesk","Yes","Yes","No",{"$f":"VLOOKUP(B28,'DOE Codes Lookups'!$A$3:$D$507,2,FALSE)","v":{"$error":"#N/A"}}]
[28,"ADESK025","(ADESK025) Autodesk Certified Professional - Revit Architecture","Autodesk Certified Professional - Revit Architecture","5",28,"Autodesk","Yes","Yes","No",{"$f":"VLOOKUP(B29,'DOE Codes Lookups'!$A$3:$D$507,2,FALSE)","v":{"$error":"#N/A"}}]
[29,"ADESK030","(ADESK030) Autodesk Certified User - Maya","Autodesk Certified User - Maya","1",29,"Autodesk","No","No","No",{"$f":"VLOOKUP(B30,'DOE Codes Lookups'!$A$3:$D$507,2,FALSE)","v":{"$error":"#N/A"}}]
[30,"ADESK032","(ADESK032) Autodesk Certified User - Fusion 360","Autodesk Certified User - Fusion 360","1",30,"Autodesk","No","No","No",{"$f":"VLOOKUP(B31,'DOE Codes Lookups'!$A$3:$D$507,2,FALSE)","v":{"$error":"#N/A"}}]
[31,"ADOBE002","(ADOBE002) Adobe Certified Expert (ACE) - After Effects","Adobe Certified Expert (ACE) - After Effects","1",31,"Adobe Systems","No","No","No",{"$f":"VLOOKUP(B32,'DOE Codes Lookups'!$A$3:$D$507,2,FALSE)","v":{"$error":"#N/A"}}]
[32,"ADOBE003","(ADOBE003) Adobe Certified Expert (ACE) - Illustrator","Adobe Certified Expert (ACE) - Illustrator","1",32,"Adobe Systems","No","No","No",{"$f":"VLOOKUP(B33,'DOE Codes Lookups'!$A$3:$D$507,2,FALSE)","v":{"$error":"#N/A"}}]
[33,"ADOBE004","(ADOBE004) Adobe Certified Expert (ACE) - InDesign","Adobe Certified Expert (ACE) - InDesign","1",33,"Adobe Systems","No","No","No",{"$f":"VLOOKUP(B34,'DOE Codes Lookups'!$A$3:$D$507,2,FALSE)","v":{"$error":"#N/A"}}]
[34,"ADOBE005","(ADOBE005) Adobe Certified Expert (ACE) - Photoshop","Adobe Certified Expert (ACE) - Photoshop","1",34,"Adobe Systems","No","No","No",{"$f":"VLOOKUP(B35,'DOE Codes Lookups'!$A$3:$D$507,2,FALSE)","v":{"$error":"#N/A"}}]
[35,"ADOBE007","(ADOBE007) Adobe Certified Expert (ACE) - Premiere Pro","Adobe Certified Expert (ACE) - Premiere Pro","1",35,"Adobe Systems","No","No","No",{"$f":"VLOOKUP(B36,'DOE Codes Lookups'!$A$3:$D$507,2,FALSE)","v":{"$error":"#N/A"}}]
[36,"ADOBE010","(ADOBE010) Adobe Certified Associate (ACA) - Dreamweaver","Adobe Certified Associate (ACA) - Dreamweaver","1",36,"Adobe Systems","No","No","No",{"$f":"VLOOKUP(B37,'DOE Codes Lookups'!$A$3:$D$507,2,FALSE)","v":{"$error":"#N/A"}}]
[37,"ADOBE011","(ADOBE011) Adobe Certified Associate (ACA) - Flash/Animate","Adobe Certified Associate (ACA) - Flash/Animate","1",37,"Adobe Systems","No","No","No",{"$f":"VLOOKUP(B38,'DOE Codes Lookups'!$A$3:$D$507,2,FALSE)","v":{"$error":"#N/A"}}]
[38,"ADOBE013","(ADOBE013) Adobe Certified Expert (ACE) - Acrobat","Adobe Certified Expert (ACE) - Acrobat","1",38,"Adobe Systems","No","No","No",{"$f":"VLOOKUP(B39,'DOE Codes Lookups'!$A$3:$D$507,2,FALSE)","v":{"$error":"#N/A"}}]
[39,"ADOBE018","(ADOBE018) Adobe Certified Associate (ACA) - Premiere Pro","Adobe Certified Associate (ACA) - Premiere Pro","1",39,"Adobe Systems","No","No","No",{"$f":"VLOOKUP(B40,'DOE Codes Lookups'!$A$3:$D$507,2,FALSE)","v":{"$error":"#N/A"}}]
[40,"ADOBE019","(ADOBE019) Adobe Certified Expert (ACE) - Dreamweaver","Adobe Certified Expert (ACE) - Dreamweaver","1",40,"Adobe Systems","No","No","No",{"$f":"VLOOKUP(B41,'DOE Codes Lookups'!$A$3:$D$507,2,FALSE)","v":{"$error":"#N/A"}}]
[41,"ADOBE020","(ADOBE020) Adobe Certified Associate (ACA) - Illustrator","Adobe Certified Associate (ACA) - Illustrator","1",41,"Adobe Systems","No","No","No",{"$f":"VLOOKUP(B42,'DOE Codes Lookups'!$A$3:$D$507,2,FALSE)","v":{"$error":"#N/A"}}]
[42,"ADOBE021","(ADOBE021) Adobe Certified Associate (ACA) - InDesign","Adobe Certified Associate (ACA) - InDesign","1",42,"Adobe Systems","No","No","No",{"$f":"VLOOKUP(B43,'DOE Codes Lookups'!$A$3:$D$507,2,FALSE)","v":{"$error":"#N/A"}}]
[43,"ADOBE022","(ADOBE022) Adobe Certified Associate (ACA) - Photoshop (Creative Cloud 2015 or later)","Adobe Certified Associate (ACA) - Photoshop (Creative Cloud 2015 or later)","1",43,"Adobe Systems","No","No","No",{"$f":"VLOOKUP(B44,'DOE Codes Lookups'!$A$3:$D$507,2,FALSE)","v":{"$error":"#N/A"}}]
[44,"ADOBE023","(ADOBE023) Adobe Certified Associate (ACA) Video Design Specialist \n(Requires two of the following: After Effects, Premiere Pro, Photoshop)","Adobe Certified Associate (ACA) Video Design Specialist \n(Requires two of the following: After Effects, Premiere Pro, Photoshop)","1",44,"Adobe Systems","No","No","No",{"$f":"VLOOKUP(B45,'DOE Codes Lookups'!$A$3:$D$507,2,FALSE)","v":{"$error":"#N/A"}}]
[45,"ADOBE024","(ADOBE024) Adobe Certified Associate (ACA) Visual Design Specialist\n(Requires two of the following: Illustrator, InDesign, Photoshop)","Adobe Certified Associate (ACA) Visual Design Specialist\n(Requires two of the following: Illustrator, InDesign, Photoshop)","1",45,"Adobe Systems","No","No","No",{"$f":"VLOOKUP(B46,'DOE Codes Lookups'!$A$3:$D$507,2,FALSE)","v":{"$error":"#N/A"}}]
[46,"ADOBE025","(ADOBE025) Adobe Certified Associate (ACA) Web Design Specialist\n(Requires two of the following: Animate, Dreamweaver and Photoshop)","Adobe Certified Associate (ACA) Web Design Specialist\n(Requires two of the following: Animate, Dreamweaver and Photoshop)","1",46,"Adobe Systems","No","No","No",{"$f":"VLOOKUP(B47,'DOE Codes Lookups'!$A$3:$D$507,2,FALSE)","v":{"$error":"#N/A"}}]
[47,"AFHDI001","(AFHDI001) Certified Healthcare Documentation Specialist (CHDS)","Certified Healthcare Documentation Specialist (CHDS)","4",47,"Association for Healthcare Documentation Integrity (AHDI)","Yes","No","Yes",{"$f":"VLOOKUP(B48,'DOE Codes Lookups'!$A$3:$D$507,2,FALSE)","v":{"$error":"#N/A"}}]
[48,"AFHDI002","(AFHDI002) Registered Healthcare Documentation Specialist (RHDS)","Registered Healthcare Documentation Specialist (RHDS)","4",48,"Association for Healthcare Documentation Integrity (AHDI)","Yes","No","Yes",{"$f":"VLOOKUP(B49,'DOE Codes Lookups'!$A$3:$D$507,2,FALSE)","v":{"$error":"#N/A"}}]
[49,"AHCSM001","(AHCSM001) Certified Registered Central Service Technician","Certified Registered Central Service Technician","1",49,"International Association of Healthcare Central Service Material Management","No","No","No",{"$f":"VLOOKUP(B50,'DOE Codes Lookups'!$A$3:$D$507,2,FALSE)","v":{"$error":"#N/A"}}]
[50,"AHIMA001","(AHIMA001) Certified Coding Associate (CCA)","Certified Coding Associate (CCA)","2",50,"American Health Information Management Association","Yes","Yes","Yes",{"$f":"VLOOKUP(B51,'DOE Codes Lookups'!$A$3:$D$507,2,FALSE)","v":{"$error":"#N/A"}}]
[51,"AHIMA002","(AHIMA002) Certified Coding Specialist (CCS)","Certified Coding Specialist (CCS)","2",51,"American Health Information Management Association","Yes","Yes","Yes",{"$f":"VLOOKUP(B52,'DOE Codes Lookups'!$A$3:$D$507,2,FALSE)","v":{"$error":"#N/A"}}]
[52,"AHIMA003","(AHIMA003) Certified Coding Specialist - Physician-based (CCS-P)","Certified Coding Specialist - Physician-based (CCS-P)","2",52,"American Health Information Management Association","Yes","Yes","Yes",{"$f":"VLOOKUP(B53,'DOE Codes Lookups'!$A$3:$D$507,2,FALSE)","v":{"$error":"#N/A"}}]
[53,"AHIMA007","(AHIMA007) Registered Health Information Administrator (RHIA)","Registered Health Information Administrator (RHIA)","4",53,"American Health Information Management Association","Yes","No","Yes",{"$f":"VLOOKUP(B54,'DOE Codes Lookups'!$A$3:$D$507,2,FALSE)","v":{"$error":"#N/A"}}]
[54,"AHIMA009","(AHIMA009) Registered Health Information Technician (RHIT)","Registered Health Information Technician (RHIT)","4",54,"American Health Information Management Association","Yes","No","Yes",{"$f":"VLOOKUP(B55,'DOE Codes Lookups'!$A$3:$D$507,2,FALSE)","v":{"$error":"#N/A"}}]
[55,"AHIMA010","(AHIMA010) Certified in Health Care Privacy & Security (CHPS)","Certified in Health Care Privacy & Security (CHPS)","4",55,"American Health Information Management Association","Yes","No","Yes",{"$f":"VLOOKUP(B56,'DOE Codes Lookups'!$A$3:$D$507,2,FALSE)","v":{"$error":"#N/A"}}]
[56,"AHIMA011","(AHIMA011) Certified Healthcare Technology Specialist - Clinician/Practitioner Consultant (CHTS-CP)","Certified Healthcare Technology Specialist - Clinician/Practitioner Consultant (CHTS-CP)","4",56,"American Health Information Management Association","Yes","No","Yes",{"$f":"VLOOKUP(B57,'DOE Codes Lookups'!$A$3:$D$507,2,FALSE)","v":{"$error":"#N/A"}}]
[57,"AHIMA012","(AHIMA012) Certified Healthcare Technology Specialist - Implementation Manager (CHTS-IM)","Certified Healthcare Technology Specialist - Implementation Manager (CHTS-IM)","4",57,"American Health Information Management Association","Yes","No","Yes",{"$f":"VLOOKUP(B58,'DOE Codes Lookups'!$A$3:$D$507,2,FALSE)","v":{"$error":"#N/A"}}]
[58,"AHIMA013","(AHIMA013) Certified Healthcare Technology Specialist - Implementation Support Specialist (CHTS-IS)","Certified Healthcare Technology Specialist - Implementation Support Specialist (CHTS-IS)","4",58,"American Health Information Management Association","Yes","No","Yes",{"$f":"VLOOKUP(B59,'DOE Codes Lookups'!$A$3:$D$507,2,FALSE)","v":{"$error":"#N/A"}}]
[59,"AHIMA014","(AHIMA014) Certified Healthcare Technology Specialist - Practice Workflow & Information Management Redesign Specialist (CHTS-PW)","Certified Healthcare Technology Specialist - Practice Workflow & Information Management Redesign Specialist (CHTS-PW)","4",59,"American Health Information Management Association","Yes","No","Yes",{"$f":"VLOOKUP(B60,'DOE Codes Lookups'!$A$3:$D$507,2,FALSE)","v":{"$error":"#N/A"}}]
[60,"AHIMA015","(AHIMA015) Certified Healthcare Technology Specialist - Technical/Software Support Staff (CHTS-TS)","Certified Healthcare Technology Specialist - Technical/Software Support Staff (CHTS-TS)","4",60,"American Health Information Management Association","Yes","No","Yes",{"$f":"VLOOKUP(B61,'DOE Codes Lookups'!$A$3:$D$507,2,FALSE)","v":{"$error":"#N/A"}}]
[61,"AHIMA016","(AHIMA016) Certified Healthcare Technology Specialist - Trainer (CHTS-TR)","Certified Healthcare Technology Specialist - Trainer (CHTS-TR)","4",61,"American Health Information Management Association","Yes","No","Yes",{"$f":"VLOOKUP(B62,'DOE Codes Lookups'!$A$3:$D$507,2,FALSE)","v":{"$error":"#N/A"}}]
[62,"AHIMA017","(AHIMA017) Certified Documentation Improvement Practitioner (CDIP)","Certified Documentation Improvement Practitioner (CDIP)","4",62,"American Health Information Management Association","Yes","No","Yes",{"$f":"VLOOKUP(B63,'DOE Codes Lookups'!$A$3:$D$507,2,FALSE)","v":{"$error":"#N/A"}}]
[63,"AHIMA018","(AHIMA018) Certified Health Data Analyst (CHDA)","Certified Health Data Analyst (CHDA)","4",63,"American Health Information Management Association","Yes","No","Yes",{"$f":"VLOOKUP(B64,'DOE Codes Lookups'!$A$3:$D$507,2,FALSE)","v":{"$error":"#N/A"}}]
[64,"AHLAE002","(AHLAE002) Hospitality Industry Knowledge (U.S.) ","Hospitality Industry Knowledge (U.S.) ","1",64,"American Hotel and Lodging Association Educational Institute","No","No","No",{"$f":"VLOOKUP(B65,'DOE Codes Lookups'!$A$3:$D$507,2,FALSE)","v":{"$error":"#N/A"}}]
[65,"AHLAE011",{"$f":"CONCATENATE(\"(\",B66,\") \",D66)","v":"(AHLAE011) Certified Hospitality Supervisor (CHS)"},"Certified Hospitality Supervisor (CHS)",{"$f":"IF(H66=\"no\",\"1\",IF(AND(H66=\"Yes\",I66=\"No\",J66=\"No\"),\"3\",IF(AND(H66=\"Yes\",I66=\"Yes\",J66=\"Yes\"),\"2\",IF(AND(H66=\"Yes\",I66=\"Yes\",J66=\"No\"),\"5\",IF(AND(H66=\"Yes\",I66=\"No\",J66=\"Yes\"),\"4\",\"0\")))))","v":"1"},65,"American Hotel and Lodging Association Educational Institute",{"$f":"IFERROR(VLOOKUP(B66,PSICFL_1819a,2,FALSE),\"No\")","v":"No"},{"$f":"IFERROR(VLOOKUP(B66,PSICFL_1819a,5,FALSE),\"No\")","v":"No"},{"$f":"IFERROR(VLOOKUP(B66,PSICFL_1819a,3,FALSE),\"No\")","v":"No"},{"$f":"VLOOKUP(B66,'DOE Codes Lookups'!$A$3:$D$507,2,FALSE)","v":{"$error":"#N/A"}}]
[66,"AIOPB001","(AIOPB001) Certified Bookkeeper","Certified Bookkeeper","1",66,"American Institute of Professional Bookkeepers","No","No","No",{"$f":"VLOOKUP(B67,'DOE Codes Lookups'!$A$3:$D$507,2,FALSE)","v":{"$error":"#N/A"}}]
[67,"AMAMA001","(AMAMA001) Certified Medical Assistant (CMA)","Certified Medical Assistant (CMA)","2",67,"American Association of Medical Assistants","Yes","Yes","Yes",{"$f":"VLOOKUP(B68,'DOE Codes Lookups'!$A$3:$D$507,2,FALSE)","v":{"$error":"#N/A"}}]
[68,"AMAOB001","(AMAOB001) Medical Laboratory Technician (MLT) ","Medical Laboratory Technician (MLT) ","2",68,"American Association of Bioanalysts (AAB)","Yes","Yes","Yes",{"$f":"VLOOKUP(B69,'DOE Codes Lookups'!$A$3:$D$507,2,FALSE)","v":{"$error":"#N/A"}}]
[69,"AMAOB002","(AMAOB002) Medical Technologist (MT(AAB))","Medical Technologist (MT(AAB))","1",69,"American Association of Bioanalysts (AAB)","No","No","No",{"$f":"VLOOKUP(B70,'DOE Codes Lookups'!$A$3:$D$507,2,FALSE)","v":{"$error":"#N/A"}}]
[70,"AMAZN001","(AMAZN001) AWS Certified Solutions Architect - Associate","AWS Certified Solutions Architect - Associate","2",70,"Amazon","Yes","Yes","Yes",{"$f":"VLOOKUP(B71,'DOE Codes Lookups'!$A$3:$D$507,2,FALSE)","v":{"$error":"#N/A"}}]
[71,"AMAZN002","(AMAZN002) AWS Certified Cloud Practitioner","AWS Certified Cloud Practitioner","2",71,"Amazon","Yes","Yes","Yes",{"$f":"VLOOKUP(B72,'DOE Codes Lookups'!$A$3:$D$507,2,FALSE)","v":{"$error":"#N/A"}}]
[72,"AMCMA001","(AMCMA001) Certified Composites Technician","Certified Composites Technician","1",72,"American Composites Manufacturers Association","No","No","No",{"$f":"VLOOKUP(B73,'DOE Codes Lookups'!$A$3:$D$507,2,FALSE)","v":{"$error":"#N/A"}}]
[73,"AMDDA002","(AMDDA002) Certified Apprentice Drafter - Architectural","Certified Apprentice Drafter - Architectural","1",73,"American Design Drafting Association","No","No","No",{"$f":"VLOOKUP(B74,'DOE Codes Lookups'!$A$3:$D$507,2,FALSE)","v":{"$error":"#N/A"}}]
[74,"AMDDA003","(AMDDA003) Certified Drafter - Architectural","Certified Drafter - Architectural","5",74,"American Design Drafting Association","Yes","Yes","No",{"$f":"VLOOKUP(B75,'DOE Codes Lookups'!$A$3:$D$507,2,FALSE)","v":{"$error":"#N/A"}}]
[75,"AMDDA004","(AMDDA004) Certified Drafter - Mechanical","Certified Drafter - Mechanical","5",75,"American Design Drafting Association","Yes","Yes","No",{"$f":"VLOOKUP(B76,'DOE Codes Lookups'!$A$3:$D$507,2,FALSE)","v":{"$error":"#N/A"}}]
[76,"AMDDA005","(AMDDA005) Certified Apprentice Drafter - Mechanical","Certified Apprentice Drafter - Mechanical","1",76,"American Design Drafting Association","No","No","No",{"$f":"VLOOKUP(B77,'DOE Codes Lookups'!$A$3:$D$507,2,FALSE)","v":{"$error":"#N/A"}}]
[77,"AMEDT002","(AMEDT002) Medical Laboratory Technician","Medical Laboratory Technician","2",77,"American Medical Technologists (AMT)","Yes","Yes","Yes",{"$f":"VLOOKUP(B78,'DOE Codes Lookups'!$A$3:$D$507,2,FALSE)","v":{"$error":"#N/A"}}]
[78,"AMEDT004","(AMEDT004) Registered Medical Assistant (RMA)","Registered Medical Assistant (RMA)","2",78,"American Medical Technologists (AMT)","Yes","Yes","Yes",{"$f":"VLOOKUP(B79,'DOE Codes Lookups'!$A$3:$D$507,2,FALSE)","v":{"$error":"#N/A"}}]
[79,"AMEDT005","(AMEDT005) Registered Phlebotomy Technician (RPT)","Registered Phlebotomy Technician (RPT)","1",79,"American Medical Technologists (AMT)","No","No","No",{"$f":"VLOOKUP(B80,'DOE Codes Lookups'!$A$3:$D$507,2,FALSE)","v":{"$error":"#N/A"}}]
[80,"AMEDT006","(AMEDT006) Medical Laboratory Assistant (CMLA)","Medical Laboratory Assistant (CMLA)","1",80,"American Medical Technologists (AMT)","No","No","No",{"$f":"VLOOKUP(B81,'DOE Codes Lookups'!$A$3:$D$507,2,FALSE)","v":{"$error":"#N/A"}}]
[81,"AMOPT001","(AMOPT001) Certified Paraoptometric Assistant (CPOA)","Certified Paraoptometric Assistant (CPOA)","4",81,"American Optometric Association","Yes","No","Yes",{"$f":"VLOOKUP(B82,'DOE Codes Lookups'!$A$3:$D$507,2,FALSE)","v":{"$error":"#N/A"}}]
[82,"AMRRT002","(AMRRT002) Registered Technologist (Radiography)","Registered Technologist (Radiography)","4",82,"American Registry of Radiologic Technologists","Yes","No","Yes",{"$f":"VLOOKUP(B83,'DOE Codes Lookups'!$A$3:$D$507,2,FALSE)","v":{"$error":"#N/A"}}]
[83,"AMRRT003","(AMRRT003) Radiologic Technologist (Sonography)","Radiologic Technologist (Sonography)","4",83,"American Registry of Radiologic Technologists","Yes","No","Yes",{"$f":"VLOOKUP(B84,'DOE Codes Lookups'!$A$3:$D$507,2,FALSE)","v":{"$error":"#N/A"}}]
[84,"AMRRT005","(AMRRT005) Registered Technologist - Quality Management (R.T.)","Registered Technologist - Quality Management (R.T.)","4",84,"American Registry of Radiologic Technologists","Yes","No","Yes",{"$f":"VLOOKUP(B85,'DOE Codes Lookups'!$A$3:$D$507,2,FALSE)","v":{"$error":"#N/A"}}]
[85,"AMRRT006","(AMRRT006) Registered Technologist (Nuclear Medicine)","Registered Technologist (Nuclear Medicine)","4",85,"American Registry of Radiologic Technologists","Yes","No","Yes",{"$f":"VLOOKUP(B86,'DOE Codes Lookups'!$A$3:$D$507,2,FALSE)","v":{"$error":"#N/A"}}]
[86,"AMRRT007","(AMRRT007) Registered Technologist (Radiation Therapy)","Registered Technologist (Radiation Therapy)","4",86,"American Registry of Radiologic Technologists","Yes","No","Yes",{"$f":"VLOOKUP(B87,'DOE Codes Lookups'!$A$3:$D$507,2,FALSE)","v":{"$error":"#N/A"}}]
[87,"AMRRT008","(AMRRT008) Computed Tomography (CT)","Computed Tomography (CT)","4",87,"American Registry of Radiologic Technologists","Yes","No","Yes",{"$f":"VLOOKUP(B88,'DOE Codes Lookups'!$A$3:$D$507,2,FALSE)","v":{"$error":"#N/A"}}]
[88,"AMSCP001","(AMSCP001) Histotechnologist, HTL(ASCP)","Histotechnologist, HTL(ASCP)","4",88,"American Society of Clinical Pathology","Yes","No","Yes",{"$f":"VLOOKUP(B89,'DOE Codes Lookups'!$A$3:$D$507,2,FALSE)","v":{"$error":"#N/A"}}]
[89,"AMSCP002","(AMSCP002) Medical Laboratory Technician (MLT(ASCP))","Medical Laboratory Technician (MLT(ASCP))","4",89,"American Society of Clinical Pathology","Yes","No","Yes",{"$f":"VLOOKUP(B90,'DOE Codes Lookups'!$A$3:$D$507,2,FALSE)","v":{"$error":"#N/A"}}]
[90,"AMSFQ001","(AMSFQ001) Manager of Quality/Organizational Excellence","Manager of Quality/Organizational Excellence","2",90,"American Society for Quality","Yes","Yes","Yes",{"$f":"VLOOKUP(B91,'DOE Codes Lookups'!$A$3:$D$507,2,FALSE)","v":{"$error":"#N/A"}}]
[91,"AMSFQ006","(AMSFQ006) Quality Improvement Associate (CQIA)","Quality Improvement Associate (CQIA)","2",91,"American Society for Quality","Yes","Yes","Yes",{"$f":"VLOOKUP(B92,'DOE Codes Lookups'!$A$3:$D$507,2,FALSE)","v":{"$error":"#N/A"}}]
[92,"AMSFQ011","(AMSFQ011) Six Sigma Black Belt (CSSBB)","Six Sigma Black Belt (CSSBB)","2",92,"American Society for Quality","Yes","Yes","Yes",{"$f":"VLOOKUP(B93,'DOE Codes Lookups'!$A$3:$D$507,2,FALSE)","v":{"$error":"#N/A"}}]
[93,"AMSFQ012","(AMSFQ012) Six Sigma Green Belt (CSSGB)","Six Sigma Green Belt (CSSGB)","2",93,"American Society for Quality","Yes","Yes","Yes",{"$f":"VLOOKUP(B94,'DOE Codes Lookups'!$A$3:$D$507,2,FALSE)","v":{"$error":"#N/A"}}]
[94,"AMSPT002","(AMSPT002) Certified Phlebotomy Technician","Certified Phlebotomy Technician","1",94,"American Society of Phlebotomy Technicians","No","No","No",{"$f":"VLOOKUP(B95,'DOE Codes Lookups'!$A$3:$D$507,2,FALSE)","v":{"$error":"#N/A"}}]
[95,"AMSTL004","(AMSTL004) Professional Designation in Supply Chain Management (PLS)","Professional Designation in Supply Chain Management (PLS)","2",95,"American Production and Inventory Control Society (APICS)","Yes","Yes","Yes",{"$f":"VLOOKUP(B96,'DOE Codes Lookups'!$A$3:$D$507,2,FALSE)","v":{"$error":"#N/A"}}]
[96,"APICS001","(APICS001) Certified in Logistics, Transportation, and Distribution (CLTD)","Certified in Logistics, Transportation, and Distribution (CLTD)","2",96,"American Production and Inventory Control Society (APICS)","Yes","Yes","Yes",{"$f":"VLOOKUP(B97,'DOE Codes Lookups'!$A$3:$D$507,2,FALSE)","v":{"$error":"#N/A"}}]
[97,"APPLE002","(APPLE002) Apple Certified Technical Coordinator","Apple Certified Technical Coordinator","1",97,"Apple, Inc.","No","No","No",{"$f":"VLOOKUP(B98,'DOE Codes Lookups'!$A$3:$D$507,2,FALSE)","v":{"$error":"#N/A"}}]
[98,"APPLE019","(APPLE019) Apple Certified Support Professional","Apple Certified Support Professional","1",98,"Apple, Inc.","No","No","No",{"$f":"VLOOKUP(B99,'DOE Codes Lookups'!$A$3:$D$507,2,FALSE)","v":{"$error":"#N/A"}}]
[99,"APPLE020","(APPLE020) Apple Certified Pro (ACP) - Final Cut Pro X","Apple Certified Pro (ACP) - Final Cut Pro X","1",99,"Apple, Inc.","No","No","No",{"$f":"VLOOKUP(B100,'DOE Codes Lookups'!$A$3:$D$507,2,FALSE)","v":{"$error":"#N/A"}}]
[100,"APPLE021","(APPLE021) Apple App Development with Swift Certification Level 1","Apple App Development with Swift Certification Level 1","1",100,"Apple, Inc.","No","No","No",{"$f":"VLOOKUP(B101,'DOE Codes Lookups'!$A$3:$D$507,2,FALSE)","v":{"$error":"#N/A"}}]
[101,"APSCO001","(APSCO001) Emergency Medical Dispatcher","Emergency Medical Dispatcher","1",101,"APCO Institute","No","No","No",{"$f":"VLOOKUP(B102,'DOE Codes Lookups'!$A$3:$D$507,2,FALSE)","v":{"$error":"#N/A"}}]
[102,"ARDMS001","(ARDMS001) Registered Diagnostic Cardiac Sonographer (RDCS)","Registered Diagnostic Cardiac Sonographer (RDCS)","4",102,"American Registry for Diagnostic Medical Sonography","Yes","No","Yes",{"$f":"VLOOKUP(B103,'DOE Codes Lookups'!$A$3:$D$507,2,FALSE)","v":{"$error":"#N/A"}}]
[103,"ARDMS002","(ARDMS002) Registered Diagnostic Medical Sonographer (RDMS)","Registered Diagnostic Medical Sonographer (RDMS)","4",103,"American Registry for Diagnostic Medical Sonography","Yes","No","Yes",{"$f":"VLOOKUP(B104,'DOE Codes Lookups'!$A$3:$D$507,2,FALSE)","v":{"$error":"#N/A"}}]
[104,"ARDMS003","(ARDMS003) Registered Vascular Technologist","Registered Vascular Technologist","4",104,"American Registry for Diagnostic Medical Sonography","Yes","No","Yes",{"$f":"VLOOKUP(B105,'DOE Codes Lookups'!$A$3:$D$507,2,FALSE)","v":{"$error":"#N/A"}}]
[105,"AWELD003","(AWELD003) AWS Certified Welder - FCAW Plate","AWS Certified Welder - FCAW Plate","2",105,"American Welding Society","Yes","Yes","Yes",{"$f":"VLOOKUP(B106,'DOE Codes Lookups'!$A$3:$D$507,2,FALSE)","v":{"$error":"#N/A"}}]
[106,"AWELD004","(AWELD004) AWS Certified Welder - GMAW Plate","AWS Certified Welder - GMAW Plate","2",106,"American Welding Society","Yes","Yes","Yes",{"$f":"VLOOKUP(B107,'DOE Codes Lookups'!$A$3:$D$507,2,FALSE)","v":{"$error":"#N/A"}}]
[107,"AWELD005","(AWELD005) AWS Certified Welder - GTAW Pipe (Carbon Steel)","AWS Certified Welder - GTAW Pipe (Carbon Steel)","2",107,"American Welding Society","Yes","Yes","Yes",{"$f":"VLOOKUP(B108,'DOE Codes Lookups'!$A$3:$D$507,2,FALSE)","v":{"$error":"#N/A"}}]
[108,"AWELD006","(AWELD006) AWS Certified Welder - GTAW Pipe (Stainless Steel to Carbon Steel)","AWS Certified Welder - GTAW Pipe (Stainless Steel to Carbon Steel)","2",108,"American Welding Society","Yes","Yes","Yes",{"$f":"VLOOKUP(B109,'DOE Codes Lookups'!$A$3:$D$507,2,FALSE)","v":{"$error":"#N/A"}}]
[109,"AWELD007","(AWELD007) AWS Certified Welder - GTAW Pipe (Stainless Steel)","AWS Certified Welder - GTAW Pipe (Stainless Steel)","2",109,"American Welding Society","Yes","Yes","Yes",{"$f":"VLOOKUP(B110,'DOE Codes Lookups'!$A$3:$D$507,2,FALSE)","v":{"$error":"#N/A"}}]
[110,"AWELD008","(AWELD008) AWS Certified Welder - GTAW Plate","AWS Certified Welder - GTAW Plate","2",110,"American Welding Society","Yes","Yes","Yes",{"$f":"VLOOKUP(B111,'DOE Codes Lookups'!$A$3:$D$507,2,FALSE)","v":{"$error":"#N/A"}}]
[111,"AWELD009","(AWELD009) AWS Certified Welder - GTAW/SMAW Pipe (Carbon Steel)","AWS Certified Welder - GTAW/SMAW Pipe (Carbon Steel)","2",111,"American Welding Society","Yes","Yes","Yes",{"$f":"VLOOKUP(B112,'DOE Codes Lookups'!$A$3:$D$507,2,FALSE)","v":{"$error":"#N/A"}}]
[112,"AWELD010","(AWELD010) AWS Certified Welder - GTAW/SMAW Pipe (Chrome PWHT)","AWS Certified Welder - GTAW/SMAW Pipe (Chrome PWHT)","2",112,"American Welding Society","Yes","Yes","Yes",{"$f":"VLOOKUP(B113,'DOE Codes Lookups'!$A$3:$D$507,2,FALSE)","v":{"$error":"#N/A"}}]
[113,"AWELD011","(AWELD011) AWS Certified Welder - SMAW Pipe","AWS Certified Welder - SMAW Pipe","2",113,"American Welding Society","Yes","Yes","Yes",{"$f":"VLOOKUP(B114,'DOE Codes Lookups'!$A$3:$D$507,2,FALSE)","v":{"$error":"#N/A"}}]
[114,"AWELD012","(AWELD012) AWS Certified Welder - SMAW Plate","AWS Certified Welder - SMAW Plate","2",114,"American Welding Society","Yes","Yes","Yes",{"$f":"VLOOKUP(B115,'DOE Codes Lookups'!$A$3:$D$507,2,FALSE)","v":{"$error":"#N/A"}}]
[115,"BNENT001","(BNENT001) Certified Hemodialysis Technologist/Technician","Certified Hemodialysis Technologist/Technician","2",115,"Board of Nephrology Examiners Inc. Nursing and Technology","Yes","Yes","Yes",{"$f":"VLOOKUP(B116,'DOE Codes Lookups'!$A$3:$D$507,2,FALSE)","v":{"$error":"#N/A"}}]
[116,"CARCH002","(CARCH002) Chief Architect Certified Apprentice","Chief Architect Certified Apprentice","1",116,"Chief Architect, Inc.","No","No","No",{"$f":"VLOOKUP(B117,'DOE Codes Lookups'!$A$3:$D$507,2,FALSE)","v":{"$error":"#N/A"}}]
[117,"CBFDM001","(CBFDM001) Certified Dietary Manager (CDM)","Certified Dietary Manager (CDM)","1",117,"Certifying Board for Dietary Managers","No","No","No",{"$f":"VLOOKUP(B118,'DOE Codes Lookups'!$A$3:$D$507,2,FALSE)","v":{"$error":"#N/A"}}]
[118,"CCINT002","(CCINT002) Registered Cardiac Sonographer (RCS)","Registered Cardiac Sonographer (RCS)","4",118,"Cardiovascular Credentialing International","Yes","No","Yes",{"$f":"VLOOKUP(B119,'DOE Codes Lookups'!$A$3:$D$507,2,FALSE)","v":{"$error":"#N/A"}}]
[119,"CCINT003","(CCINT003) Registered Cardiovascular Invasive Specialist","Registered Cardiovascular Invasive Specialist","4",119,"Cardiovascular Credentialing International","Yes","No","Yes",{"$f":"VLOOKUP(B120,'DOE Codes Lookups'!$A$3:$D$507,2,FALSE)","v":{"$error":"#N/A"}}]
[120,"CCINT004","(CCINT004) Registered Vascular Specialist","Registered Vascular Specialist","4",120,"Cardiovascular Credentialing International","Yes","No","Yes",{"$f":"VLOOKUP(B121,'DOE Codes Lookups'!$A$3:$D$507,2,FALSE)","v":{"$error":"#N/A"}}]
[121,"CDREG001","(CDREG001) Dietetic Technician, Registered (DTR)","Dietetic Technician, Registered (DTR)","4",121,"Commission on Dietetic Registration","Yes","No","Yes",{"$f":"VLOOKUP(B122,'DOE Codes Lookups'!$A$3:$D$507,2,FALSE)","v":{"$error":"#N/A"}}]
[122,"CDREG002","(CDREG002) Registered Dietician","Registered Dietician","1",122,"Commission on Dietetic Registration","No","No","No",{"$f":"VLOOKUP(B123,'DOE Codes Lookups'!$A$3:$D$507,2,FALSE)","v":{"$error":"#N/A"}}]
[123,"CERHB001","(CERHB001) Biotechnician Assistant","Biotechnician Assistant","1",123,"Center for Excellence for Regenerative Health Biotechnology at University of Florida","No","No","No",{"$f":"VLOOKUP(B124,'DOE Codes Lookups'!$A$3:$D$507,2,FALSE)","v":{"$error":"#N/A"}}]
[124,"CERTI002","(CERTI002) Entrepreneurship & Small Business","Entrepreneurship & Small Business","1",124,"Certiport, A Pearson VUE Business","No","No","No",{"$f":"VLOOKUP(B125,'DOE Codes Lookups'!$A$3:$D$507,2,FALSE)","v":{"$error":"#N/A"}}]
[125,"CEWFD001","(CEWFD001) Energy Industry Fundamentals Certificate","Energy Industry Fundamentals Certificate","1",125,"Center for Energy Workforce Development","No","No","No",{"$f":"VLOOKUP(B126,'DOE Codes Lookups'!$A$3:$D$507,2,FALSE)","v":{"$error":"#N/A"}}]
[126,"CIDIN001","(CIDIN001) Certified Interior Decorator","Certified Interior Decorator","1",126,"Certified Interior Decorators International (C.I.D.)","No","No","No",{"$f":"VLOOKUP(B127,'DOE Codes Lookups'!$A$3:$D$507,2,FALSE)","v":{"$error":"#N/A"}}]
[127,"CINST001","(CINST001) C++ Certified Associate Programmer (CPA)","C++ Certified Associate Programmer (CPA)","1",127,"C++ Institute","No","No","No",{"$f":"VLOOKUP(B128,'DOE Codes Lookups'!$A$3:$D$507,2,FALSE)","v":{"$error":"#N/A"}}]
[128,"CISCO001","(CISCO001) Cisco Certified Design Associate (CCDA)","Cisco Certified Design Associate (CCDA)","2",128,"Cisco Systems, Inc.","Yes","Yes","Yes",{"$f":"VLOOKUP(B129,'DOE Codes Lookups'!$A$3:$D$507,2,FALSE)","v":{"$error":"#N/A"}}]
[129,"CISCO002",{"$f":"CONCATENATE(\"(\",B130,\") \",D130)","v":"(CISCO002) Cisco Certified Design Professional (CCDP)"},"Cisco Certified Design Professional (CCDP)",{"$f":"IF(H130=\"no\",\"1\",IF(AND(H130=\"Yes\",I130=\"No\",J130=\"No\"),\"3\",IF(AND(H130=\"Yes\",I130=\"Yes\",J130=\"Yes\"),\"2\",IF(AND(H130=\"Yes\",I130=\"Yes\",J130=\"No\"),\"5\",IF(AND(H130=\"Yes\",I130=\"No\",J130=\"Yes\"),\"4\",\"0\")))))","v":"2"},129,"Cisco Systems, Inc.",{"$f":"IFERROR(VLOOKUP(B130,PSICFL_1819a,2,FALSE),\"No\")","v":"Yes"},{"$f":"IFERROR(VLOOKUP(B130,PSICFL_1819a,5,FALSE),\"No\")","v":"Yes"},{"$f":"IFERROR(VLOOKUP(B130,PSICFL_1819a,3,FALSE),\"No\")","v":"Yes"},{"$f":"VLOOKUP(B130,'DOE Codes Lookups'!$A$3:$D$507,2,FALSE)","v":{"$error":"#N/A"}}]
[130,"CISCO003","(CISCO003) Cisco Certified Entry Network Technician (CCENT)","Cisco Certified Entry Network Technician (CCENT)","1",130,"Cisco Systems, Inc.","No","No","No",{"$f":"VLOOKUP(B131,'DOE Codes Lookups'!$A$3:$D$507,2,FALSE)","v":{"$error":"#N/A"}}]
[131,"CISCO004","(CISCO004) Cisco Certified Network Associate (CCNA)","Cisco Certified Network Associate (CCNA)","2",131,"Cisco Systems, Inc.","Yes","Yes","Yes",{"$f":"VLOOKUP(B132,'DOE Codes Lookups'!$A$3:$D$507,2,FALSE)","v":{"$error":"#N/A"}}]
[132,"CISCO005","(CISCO005) Cisco Certified Network Professional (CCNP)","Cisco Certified Network Professional (CCNP)","2",132,"Cisco Systems, Inc.","Yes","Yes","Yes",{"$f":"VLOOKUP(B133,'DOE Codes Lookups'!$A$3:$D$507,2,FALSE)","v":{"$error":"#N/A"}}]
[133,"CISCO009","(CISCO009) Cisco Certified Architect","Cisco Certified Architect","2",133,"Cisco Systems, Inc.","Yes","Yes","Yes",{"$f":"VLOOKUP(B134,'DOE Codes Lookups'!$A$3:$D$507,2,FALSE)","v":{"$error":"#N/A"}}]
[134,"CISCO010","(CISCO010) Cisco Certified Design Expert (CCDE)","Cisco Certified Design Expert (CCDE)","2",134,"Cisco Systems, Inc.","Yes","Yes","Yes",{"$f":"VLOOKUP(B135,'DOE Codes Lookups'!$A$3:$D$507,2,FALSE)","v":{"$error":"#N/A"}}]
[135,"CISCO011","(CISCO011) Cisco Certified Network Associate Security (CCNA Security)","Cisco Certified Network Associate Security (CCNA Security)","2",135,"Cisco Systems, Inc.","Yes","Yes","Yes",{"$f":"VLOOKUP(B136,'DOE Codes Lookups'!$A$3:$D$507,2,FALSE)","v":{"$error":"#N/A"}}]
[136,"CISCO013","(CISCO013) Cisco Certified Network Associate Wireless (CCNA Wireless)","Cisco Certified Network Associate Wireless (CCNA Wireless)","2",136,"Cisco Systems, Inc.","Yes","Yes","Yes",{"$f":"VLOOKUP(B137,'DOE Codes Lookups'!$A$3:$D$507,2,FALSE)","v":{"$error":"#N/A"}}]
[137,"CISCO017","(CISCO017) Cisco Certified Network Professional Wireless (CCNP Wireless)","Cisco Certified Network Professional Wireless (CCNP Wireless)","2",137,"Cisco Systems, Inc.","Yes","Yes","Yes",{"$f":"VLOOKUP(B138,'DOE Codes Lookups'!$A$3:$D$507,2,FALSE)","v":{"$error":"#N/A"}}]
[138,"CISCO018","(CISCO018) Cisco Certified Internetwork Expert Routing and Switching (CCIE Routing & Switching)","Cisco Certified Internetwork Expert Routing and Switching (CCIE Routing & Switching)","2",138,"Cisco Systems, Inc.","Yes","Yes","Yes",{"$f":"VLOOKUP(B139,'DOE Codes Lookups'!$A$3:$D$507,2,FALSE)","v":{"$error":"#N/A"}}]
[139,"CISCO019","(CISCO019) Cisco Certified Internetwork Expert Security (CCIE Security)","Cisco Certified Internetwork Expert Security (CCIE Security)","2",139,"Cisco Systems, Inc.","Yes","Yes","Yes",{"$f":"VLOOKUP(B140,'DOE Codes Lookups'!$A$3:$D$507,2,FALSE)","v":{"$error":"#N/A"}}]
[140,"CISCO024","(CISCO024) Cisco Certified Network Associate Routing and Switching (CCNA Routing and Switching)","Cisco Certified Network Associate Routing and Switching (CCNA Routing and Switching)","2",140,"Cisco Systems, Inc.","Yes","Yes","Yes",{"$f":"VLOOKUP(B141,'DOE Codes Lookups'!$A$3:$D$507,2,FALSE)","v":{"$error":"#N/A"}}]
[141,"CISCO025","(CISCO025) Cisco Certified Network Associate Cyber Ops (CCNA Cyber Ops)","Cisco Certified Network Associate Cyber Ops (CCNA Cyber Ops)","2",141,"Cisco Systems, Inc.","Yes","Yes","Yes",{"$f":"VLOOKUP(B142,'DOE Codes Lookups'!$A$3:$D$507,2,FALSE)","v":{"$error":"#N/A"}}]
[142,"CISCO026","(CISCO026) Cisco Certified Network Associate (CCNA)","Cisco Certified Network Associate (CCNA)","1",142,"Cisco Systems","No","No","No",{"$f":"VLOOKUP(B143,'DOE Codes Lookups'!$A$3:$D$507,2,FALSE)","v":{"$error":"#N/A"}}]
[143,"CITRX004","(CITRX004) Citrix Certified Administrator (CCA)- XenApp","Citrix Certified Administrator (CCA)- XenApp","2",143,"Citrix Systems Incorporated","Yes","Yes","Yes",{"$f":"VLOOKUP(B144,'DOE Codes Lookups'!$A$3:$D$507,2,FALSE)","v":{"$error":"#N/A"}}]
[144,"CNCSI001","(CNCSI001) Mastercam Certified Programmer Mill Level 1 (CPgM1)","Mastercam Certified Programmer Mill Level 1 (CPgM1)","2",144,"CNC Software Inc.","Yes","Yes","Yes",{"$f":"VLOOKUP(B145,'DOE Codes Lookups'!$A$3:$D$507,2,FALSE)","v":{"$error":"#N/A"}}]
[145,"CNCSI002","(CNCSI002) Mastercam Associate Certification - Mill Design and Toolpaths","Mastercam Associate Certification - Mill Design and Toolpaths","2",145,"CNC Software Inc.","Yes","Yes","Yes",{"$f":"VLOOKUP(B146,'DOE Codes Lookups'!$A$3:$D$507,2,FALSE)","v":{"$error":"#N/A"}}]
[146,"COMPT001","(COMPT001) CompTIA A+","CompTIA A+","2",146,"Computing Technology Industry Association (CompTIA)","Yes","Yes","Yes",{"$f":"VLOOKUP(B147,'DOE Codes Lookups'!$A$3:$D$507,2,FALSE)","v":{"$error":"#N/A"}}]
[147,"COMPT002","(COMPT002) CompTIA CDIA+","CompTIA CDIA+","1",147,"Computing Technology Industry Association (CompTIA )","No","No","No",{"$f":"VLOOKUP(B148,'DOE Codes Lookups'!$A$3:$D$507,2,FALSE)","v":{"$error":"#N/A"}}]
[148,"COMPT005","(COMPT005) CompTIA Linux+","CompTIA Linux+","2",148,"Computing Technology Industry Association (CompTIA)","Yes","Yes","Yes",{"$f":"VLOOKUP(B149,'DOE Codes Lookups'!$A$3:$D$507,2,FALSE)","v":{"$error":"#N/A"}}]
[149,"COMPT006","(COMPT006) CompTIA Network+","CompTIA Network+","2",149,"Computing Technology Industry Association (CompTIA)","Yes","Yes","Yes",{"$f":"VLOOKUP(B150,'DOE Codes Lookups'!$A$3:$D$507,2,FALSE)","v":{"$error":"#N/A"}}]
[150,"COMPT007","(COMPT007) CompTIA Project+","CompTIA Project+","2",150,"Computing Technology Industry Association (CompTIA)","Yes","Yes","Yes",{"$f":"VLOOKUP(B151,'DOE Codes Lookups'!$A$3:$D$507,2,FALSE)","v":{"$error":"#N/A"}}]
[151,"COMPT008","(COMPT008) CompTIA Security+","CompTIA Security+","2",151,"Computing Technology Industry Association (CompTIA)","Yes","Yes","Yes",{"$f":"VLOOKUP(B152,'DOE Codes Lookups'!$A$3:$D$507,2,FALSE)","v":{"$error":"#N/A"}}]
[152,"COMPT009","(COMPT009) CompTIA Server+","CompTIA Server+","2",152,"Computing Technology Industry Association (CompTIA)","Yes","Yes","Yes",{"$f":"VLOOKUP(B153,'DOE Codes Lookups'!$A$3:$D$507,2,FALSE)","v":{"$error":"#N/A"}}]
[153,"COMPT014","(COMPT014) CompTIA Cloud+","CompTIA Cloud+","2",153,"Computing Technology Industry Association (CompTIA)","Yes","Yes","Yes",{"$f":"VLOOKUP(B154,'DOE Codes Lookups'!$A$3:$D$507,2,FALSE)","v":{"$error":"#N/A"}}]
[154,"COMPT016","(COMPT016) CompTIA Cybersecurity Analyst (CySA+)","CompTIA Cybersecurity Analyst (CySA+)","2",154,"Computing Technology Industry Association (CompTIA)","Yes","Yes","Yes",{"$f":"VLOOKUP(B155,'DOE Codes Lookups'!$A$3:$D$507,2,FALSE)","v":{"$error":"#N/A"}}]
[155,"COMPT017","(COMPT017) CompTIA Advanced Security Practitioner (CASP)","CompTIA Advanced Security Practitioner (CASP)","2",155,"Computing Technology Industry Association (CompTIA )","Yes","Yes","Yes",{"$f":"VLOOKUP(B156,'DOE Codes Lookups'!$A$3:$D$507,2,FALSE)","v":{"$error":"#N/A"}}]
[156,"COMPT018","(COMPT018) CompTIA IT Fundamentals+","CompTIA IT Fundamentals+","1",156,"Computing Technology Industry Association (CompTIA)","No","No","No",{"$f":"VLOOKUP(B157,'DOE Codes Lookups'!$A$3:$D$507,2,FALSE)","v":{"$error":"#N/A"}}]
[157,"COMPT019","(COMPT019) CompTIA PenTest+","CompTIA PenTest+","2",157,"Computing Technology Industry Association (CompTIA)","Yes","Yes","Yes",{"$f":"VLOOKUP(B158,'DOE Codes Lookups'!$A$3:$D$507,2,FALSE)","v":{"$error":"#N/A"}}]
[158,"CPREC001","(CPREC001) Child Development Associate (CDA)","Child Development Associate (CDA)","1",158,"Council for Professional Recognition","No","No","No",{"$f":"VLOOKUP(B159,'DOE Codes Lookups'!$A$3:$D$507,2,FALSE)","v":{"$error":"#N/A"}}]
[159,"CPSTL001","(CPSTL001) Check Point Certified Security Administrator (CCSA)","Check Point Certified Security Administrator (CCSA)","2",159,"Check Point Software Technologies Ltd.","Yes","Yes","Yes",{"$f":"VLOOKUP(B160,'DOE Codes Lookups'!$A$3:$D$507,2,FALSE)","v":{"$error":"#N/A"}}]
[160,"CPSTL002","(CPSTL002) Check Point Certified Security Expert (CCSE)","Check Point Certified Security Expert (CCSE)","2",160,"Check Point Software Technologies Ltd.","Yes","Yes","Yes",{"$f":"VLOOKUP(B161,'DOE Codes Lookups'!$A$3:$D$507,2,FALSE)","v":{"$error":"#N/A"}}]
[161,"CSCMP001","(CSCMP001) SCPro Fundamentals Bundle (8 exams)","SCPro Fundamentals Bundle (8 exams)","2",161,"Council of Supply Chain Management Professionals","Yes","Yes","Yes",{"$f":"VLOOKUP(B162,'DOE Codes Lookups'!$A$3:$D$507,2,FALSE)","v":{"$error":"#N/A"}}]
[162,"CWNPT001","(CWNPT001) Certified Wireless Network Administrator (CWNA) ","Certified Wireless Network Administrator (CWNA) ","2",162,"CWNP","Yes","Yes","Yes",{"$f":"VLOOKUP(B163,'DOE Codes Lookups'!$A$3:$D$507,2,FALSE)","v":{"$error":"#N/A"}}]
[163,"DANBD001","(DANBD001) Certified Dental Assistant (CDA)","Certified Dental Assistant (CDA)","2",163,"Dental Assisting National Board","Yes","Yes","Yes",{"$f":"VLOOKUP(B164,'DOE Codes Lookups'!$A$3:$D$507,2,FALSE)","v":{"$error":"#N/A"}}]
[164,"DDSOA001","(DDSOA001) DSA Certified Professional Decorator","DSA Certified Professional Decorator","1",164,"Designer/Decorator Society of America","No","No","No",{"$f":"VLOOKUP(B165,'DOE Codes Lookups'!$A$3:$D$507,2,FALSE)","v":{"$error":"#N/A"}}]
[165,"DIGIT001","(DIGIT001) STARS GIS Technician","STARS GIS Technician","1",165,"DigitalQuest, Inc.","No","No","No",{"$f":"VLOOKUP(B166,'DOE Codes Lookups'!$A$3:$D$507,2,FALSE)","v":{"$error":"#N/A"}}]
[166,"EDTSO001","(EDTSO001) ParaPro Assessment","ParaPro Assessment","1",166,"Educational Testing Service","No","No","No",{"$f":"VLOOKUP(B167,'DOE Codes Lookups'!$A$3:$D$507,2,FALSE)","v":{"$error":"#N/A"}}]
[167,"EMCSQ001","(EMCSQ001) Information Storage and Management (EMCISA) Associate","Information Storage and Management (EMCISA) Associate","2",167,"EMC","Yes","Yes","Yes",{"$f":"VLOOKUP(B168,'DOE Codes Lookups'!$A$3:$D$507,2,FALSE)","v":{"$error":"#N/A"}}]
[168,"ENTCP001","(ENTCP001) ETCP Certified Entertainment Electrician","ETCP Certified Entertainment Electrician","2",168,"Entertainment Technician Certification Program (ETCP)","Yes","Yes","Yes",{"$f":"VLOOKUP(B169,'DOE Codes Lookups'!$A$3:$D$507,2,FALSE)","v":{"$error":"#N/A"}}]
[169,"ENTCP002","(ENTCP002) ETCP Certified Rigger – Arena","ETCP Certified Rigger – Arena","1",169,"Entertainment Technician Certification Program (ETCP)","No","No","No",{"$f":"VLOOKUP(B170,'DOE Codes Lookups'!$A$3:$D$507,2,FALSE)","v":{"$error":"#N/A"}}]
[170,"ENTCP003","(ENTCP003) ETCP Certified Rigger – Theatre","ETCP Certified Rigger – Theatre","1",170,"Entertainment Technician Certification Program (ETCP)","No","No","No",{"$f":"VLOOKUP(B171,'DOE Codes Lookups'!$A$3:$D$507,2,FALSE)","v":{"$error":"#N/A"}}]
[171,"ESRIC001","(ESRIC001) ArcGIS Desktop Entry","ArcGIS Desktop Entry","1",171,"ESRI","No","No","No",{"$f":"VLOOKUP(B172,'DOE Codes Lookups'!$A$3:$D$507,2,FALSE)","v":{"$error":"#N/A"}}]
[172,"ETAIN002","(ETAIN002) Fiber Optics Installer (FOI)","Fiber Optics Installer (FOI)","2",172,"Electronics Technician Association International","Yes","Yes","Yes",{"$f":"VLOOKUP(B173,'DOE Codes Lookups'!$A$3:$D$507,2,FALSE)","v":{"$error":"#N/A"}}]
[173,"ETAIN008","(ETAIN008) Associate Certified Electronics Technician (CETa)","Associate Certified Electronics Technician (CETa)","2",173,"Electronics Technician Association International","Yes","Yes","Yes",{"$f":"VLOOKUP(B174,'DOE Codes Lookups'!$A$3:$D$507,2,FALSE)","v":{"$error":"#N/A"}}]
[174,"ETAIN009","(ETAIN009) Data Cabling Installer Certification (DCIC)","Data Cabling Installer Certification (DCIC)","2",174,"Electronics Technician Association International","Yes","Yes","Yes",{"$f":"VLOOKUP(B175,'DOE Codes Lookups'!$A$3:$D$507,2,FALSE)","v":{"$error":"#N/A"}}]
[175,"ETAIN010","(ETAIN010) Fiber Optics Technician (FOT)","Fiber Optics Technician (FOT)","2",175,"Electronics Technician Association International","Yes","Yes","Yes",{"$f":"VLOOKUP(B176,'DOE Codes Lookups'!$A$3:$D$507,2,FALSE)","v":{"$error":"#N/A"}}]
[176,"ETAIN011","(ETAIN011) Fiber Optics Technician-Outside Plant (FOT-OSP)","Fiber Optics Technician-Outside Plant (FOT-OSP)","2",176,"Electronics Technician Association International","Yes","Yes","Yes",{"$f":"VLOOKUP(B177,'DOE Codes Lookups'!$A$3:$D$507,2,FALSE)","v":{"$error":"#N/A"}}]
[177,"ETAIN012","(ETAIN012) Photonics Technician - Operator (PTO)","Photonics Technician - Operator (PTO)","2",177,"Electronics Technician Association International","Yes","Yes","Yes",{"$f":"VLOOKUP(B178,'DOE Codes Lookups'!$A$3:$D$507,2,FALSE)","v":{"$error":"#N/A"}}]
[178,"ETAIN013","(ETAIN013) Photonics Technician Specialist (PTS)","Photonics Technician Specialist (PTS)","2",178,"Electronics Technician Association International","Yes","Yes","Yes",{"$f":"VLOOKUP(B179,'DOE Codes Lookups'!$A$3:$D$507,2,FALSE)","v":{"$error":"#N/A"}}]
[179,"ETAIN014","(ETAIN014) Photovoltaic Installer (PVI) - Level 1","Photovoltaic Installer (PVI) - Level 1","2",179,"Electronics Technician Association International","Yes","Yes","Yes",{"$f":"VLOOKUP(B180,'DOE Codes Lookups'!$A$3:$D$507,2,FALSE)","v":{"$error":"#N/A"}}]
[180,"ETAIN019","(ETAIN019) Small Wind Installer (SWI) - Level 1","Small Wind Installer (SWI) - Level 1","2",180,"Electronics Technician Association International","Yes","Yes","Yes",{"$f":"VLOOKUP(B181,'DOE Codes Lookups'!$A$3:$D$507,2,FALSE)","v":{"$error":"#N/A"}}]
[181,"ETAIN022","(ETAIN022) Specialist in Precision Optics (SPO)","Specialist in Precision Optics (SPO)","2",181,"Electronics Technician Association International","Yes","Yes","Yes",{"$f":"VLOOKUP(B182,'DOE Codes Lookups'!$A$3:$D$507,2,FALSE)","v":{"$error":"#N/A"}}]
[182,"ETAIN023","(ETAIN023) Technician in Precision Optics (TPO)","Technician in Precision Optics (TPO)","2",182,"Electronics Technician Association International","Yes","Yes","Yes",{"$f":"VLOOKUP(B183,'DOE Codes Lookups'!$A$3:$D$507,2,FALSE)","v":{"$error":"#N/A"}}]
[183,"FASMB001","(FASMB001) Massage & Bodywork Licensing Examination (MBLEx)","Massage & Bodywork Licensing Examination (MBLEx)","4",183,"Federation of State Massage Therapy Boards","Yes","No","Yes",{"$f":"VLOOKUP(B184,'DOE Codes Lookups'!$A$3:$D$507,2,FALSE)","v":{"$error":"#N/A"}}]
[184,"FDFCC001","(FDFCC001) Licensed Funeral Director","Licensed Funeral Director","1",184,"Florida Department of Financial Services, Division of Funeral, Cemetery & Consumer Services","No","No","No",{"$f":"VLOOKUP(B185,'DOE Codes Lookups'!$A$3:$D$507,2,FALSE)","v":{"$error":"#N/A"}}]
[185,"FDLIC004","(FDLIC004) Security Officer (Class D)","Security Officer (Class D)","1",185,"Florida Department of Agriculture and Consumer Services, Division of Licensing","No","No","No",{"$f":"VLOOKUP(B186,'DOE Codes Lookups'!$A$3:$D$507,2,FALSE)","v":{"$error":"#N/A"}}]
[186,"FDMQA001","(FDMQA001) Basic X-Ray Machine Operator","Basic X-Ray Machine Operator","1",186,"Florida Department of Health","No","No","No",{"$f":"VLOOKUP(B187,'DOE Codes Lookups'!$A$3:$D$507,2,FALSE)","v":{"$error":"#N/A"}}]
[187,"FDMQA002","(FDMQA002) Certified Nursing Assistant (CNA)","Certified Nursing Assistant (CNA)","2",187,"Florida Department of Health","Yes","Yes","Yes",{"$f":"VLOOKUP(B188,'DOE Codes Lookups'!$A$3:$D$507,2,FALSE)","v":{"$error":"#N/A"}}]
[188,"FDMQA010","(FDMQA010) Licensed Dental Hygienist","Licensed Dental Hygienist","4",188,"Florida Department of Health","Yes","No","Yes",{"$f":"VLOOKUP(B189,'DOE Codes Lookups'!$A$3:$D$507,2,FALSE)","v":{"$error":"#N/A"}}]
[189,"FDMQA014","(FDMQA014) Paramedic (EMT-P)","Paramedic (EMT-P)","2",189,"Florida Department of Health","Yes","Yes","Yes",{"$f":"VLOOKUP(B190,'DOE Codes Lookups'!$A$3:$D$507,2,FALSE)","v":{"$error":"#N/A"}}]
[190,"FDMQA018","(FDMQA018) Licensed Physical Therapist Assistant","Licensed Physical Therapist Assistant","4",190,"Florida Department of Health","Yes","No","Yes",{"$f":"VLOOKUP(B191,'DOE Codes Lookups'!$A$3:$D$507,2,FALSE)","v":{"$error":"#N/A"}}]
[191,"FDMQA025","(FDMQA025) Licensed Optician","Licensed Optician","4",191,"Florida Department of Health","Yes","No","Yes",{"$f":"VLOOKUP(B192,'DOE Codes Lookups'!$A$3:$D$507,2,FALSE)","v":{"$error":"#N/A"}}]
[192,"FDMQA030","(FDMQA030) 911 Public Safety Telecommunicator","911 Public Safety Telecommunicator","2",192,"Florida Department of Health","Yes","Yes","Yes",{"$f":"VLOOKUP(B193,'DOE Codes Lookups'!$A$3:$D$507,2,FALSE)","v":{"$error":"#N/A"}}]
[193,"FDMQA031",{"$f":"CONCATENATE(\"(\",B194,\") \",D194)","v":"(FDMQA031) Local Anesthesia for Dental Hygienists"},"Local Anesthesia for Dental Hygienists",{"$f":"IF(H194=\"no\",\"1\",IF(AND(H194=\"Yes\",I194=\"No\",J194=\"No\"),\"3\",IF(AND(H194=\"Yes\",I194=\"Yes\",J194=\"Yes\"),\"2\",IF(AND(H194=\"Yes\",I194=\"Yes\",J194=\"No\"),\"5\",IF(AND(H194=\"Yes\",I194=\"No\",J194=\"Yes\"),\"4\",\"0\")))))","v":"1"},193,"Florida Department of Health",{"$f":"IFERROR(VLOOKUP(B194,PSICFL_1819a,2,FALSE),\"No\")","v":"No"},{"$f":"IFERROR(VLOOKUP(B194,PSICFL_1819a,5,FALSE),\"No\")","v":"No"},{"$f":"IFERROR(VLOOKUP(B194,PSICFL_1819a,3,FALSE),\"No\")","v":"No"},{"$f":"VLOOKUP(B194,'DOE Codes Lookups'!$A$3:$D$507,2,FALSE)","v":{"$error":"#N/A"}}]
[194,"FEDAA001","(FEDAA001) FAA Air Traffic Control Specialist","FAA Air Traffic Control Specialist","1",194,"Federal Aviation Administration","No","No","No",{"$f":"VLOOKUP(B195,'DOE Codes Lookups'!$A$3:$D$507,2,FALSE)","v":{"$error":"#N/A"}}]
[195,"FEDAA002","(FEDAA002) FAA Aviation Maintenance Technician - General","FAA Aviation Maintenance Technician - General","2",195,"Federal Aviation Administration","Yes","Yes","Yes",{"$f":"VLOOKUP(B196,'DOE Codes Lookups'!$A$3:$D$507,2,FALSE)","v":{"$error":"#N/A"}}]
[196,"FEDAA004","(FEDAA004) FAA Aviation Mechanic Technician - Airframe","FAA Aviation Mechanic Technician - Airframe","2",196,"Federal Aviation Administration","Yes","Yes","Yes",{"$f":"VLOOKUP(B197,'DOE Codes Lookups'!$A$3:$D$507,2,FALSE)","v":{"$error":"#N/A"}}]
[197,"FEDAA005","(FEDAA005) FAA Certified Flight Instructor License","FAA Certified Flight Instructor License","1",197,"Federal Aviation Administration","No","No","No",{"$f":"VLOOKUP(B198,'DOE Codes Lookups'!$A$3:$D$507,2,FALSE)","v":{"$error":"#N/A"}}]
[198,"FEDAA006","(FEDAA006) FAA Commercial Pilot","FAA Commercial Pilot","1",198,"Federal Aviation Administration","No","No","No",{"$f":"VLOOKUP(B199,'DOE Codes Lookups'!$A$3:$D$507,2,FALSE)","v":{"$error":"#N/A"}}]
[199,"FEDAA010","(FEDAA010) FAA Aviation Maintenance Technician - Powerplant","FAA Aviation Maintenance Technician - Powerplant","2",199,"Federal Aviation Administration","Yes","Yes","Yes",{"$f":"VLOOKUP(B200,'DOE Codes Lookups'!$A$3:$D$507,2,FALSE)","v":{"$error":"#N/A"}}]
[200,"FEDAA011","(FEDAA011) FAA Private Pilot","FAA Private Pilot","1",200,"Federal Aviation Administration","No","No","No",{"$f":"VLOOKUP(B201,'DOE Codes Lookups'!$A$3:$D$507,2,FALSE)","v":{"$error":"#N/A"}}]
[201,"FEDAA013","(FEDAA013) FAA Ground School","FAA Ground School","1",201,"Federal Aviation Administration","No","No","No",{"$f":"VLOOKUP(B202,'DOE Codes Lookups'!$A$3:$D$507,2,FALSE)","v":{"$error":"#N/A"}}]
[202,"FEDCC001","(FEDCC001) FCC General Radiotelephone Operator License (PG)","FCC General Radiotelephone Operator License (PG)","1",202,"Federal Communications Commission","No","No","No",{"$f":"VLOOKUP(B203,'DOE Codes Lookups'!$A$3:$D$507,2,FALSE)","v":{"$error":"#N/A"}}]
[203,"FLADA001","(FLADA001) Florida Automobile Dealers Association (FADA) Certified Technician","Florida Automobile Dealers Association (FADA) Certified Technician","1",203,"Florida Automobile Dealers Association","No","No","No",{"$f":"VLOOKUP(B204,'DOE Codes Lookups'!$A$3:$D$507,2,FALSE)","v":{"$error":"#N/A"}}]
[204,"FLDAS002","(FLDAS002) License - Customer Representative (4-40)","License - Customer Representative (4-40)","1",204,"Florida Department of Financial Services, Division of Agent and Agency Services","No","No","No",{"$f":"VLOOKUP(B205,'DOE Codes Lookups'!$A$3:$D$507,2,FALSE)","v":{"$error":"#N/A"}}]
[205,"FLDAS003","(FLDAS003) License - General Lines Agent (2-20)","License - General Lines Agent (2-20)","1",205,"Florida Department of Financial Services, Division of Agent and Agency Services","No","No","No",{"$f":"VLOOKUP(B206,'DOE Codes Lookups'!$A$3:$D$507,2,FALSE)","v":{"$error":"#N/A"}}]
[206,"FLDAS006","(FLDAS006) License - Life, Health and Annuities","License - Life, Health and Annuities","1",206,"Florida Department of Financial Services, Division of Agent and Agency Services","No","No","No",{"$f":"VLOOKUP(B207,'DOE Codes Lookups'!$A$3:$D$507,2,FALSE)","v":{"$error":"#N/A"}}]
[207,"FLDCF001","(FLDCF001) Director Credential","Director Credential","1",207,"Florida Department of Children and Families, Child Care Services","No","No","No",{"$f":"VLOOKUP(B208,'DOE Codes Lookups'!$A$3:$D$507,2,FALSE)","v":{"$error":"#N/A"}}]
[208,"FLDCF003","(FLDCF003) Florida Child Care Professional Credential","Florida Child Care Professional Credential","1",208,"Florida Department of Children and Families, Child Care Services","No","No","No",{"$f":"VLOOKUP(B209,'DOE Codes Lookups'!$A$3:$D$507,2,FALSE)","v":{"$error":"#N/A"}}]
[209,"FLDCF005","(FLDCF005) Staff Credential","Staff Credential","1",209,"Florida Department of Children and Families, Child Care Services","No","No","No",{"$f":"VLOOKUP(B210,'DOE Codes Lookups'!$A$3:$D$507,2,FALSE)","v":{"$error":"#N/A"}}]
[210,"FLDCF006","(FLDCF006) VPK Director Credential","VPK Director Credential","1",210,"Florida Department of Children and Families, Child Care Services","No","No","No",{"$f":"VLOOKUP(B211,'DOE Codes Lookups'!$A$3:$D$507,2,FALSE)","v":{"$error":"#N/A"}}]
[211,"FLDDL001","(FLDDL001) Commercial Driver License (CDL)","Commercial Driver License (CDL)","1",211,"Florida Department of Highway Safety and Motor Vehicles, Division of Driver Licenses","No","No","No",{"$f":"VLOOKUP(B212,'DOE Codes Lookups'!$A$3:$D$507,2,FALSE)","v":{"$error":"#N/A"}}]
[212,"FLDEP001","(FLDEP001) Wastewater Treatment Plant Operator Level A","Wastewater Treatment Plant Operator Level A","1",212,"Florida Department of Environmental Protection","No","No","No",{"$f":"VLOOKUP(B213,'DOE Codes Lookups'!$A$3:$D$507,2,FALSE)","v":{"$error":"#N/A"}}]
[213,"FLDEP002","(FLDEP002) Wastewater Treatment Plant Operator Level B","Wastewater Treatment Plant Operator Level B","1",213,"Florida Department of Environmental Protection","No","No","No",{"$f":"VLOOKUP(B214,'DOE Codes Lookups'!$A$3:$D$507,2,FALSE)","v":{"$error":"#N/A"}}]
[214,"FLDEP003","(FLDEP003) Wastewater Treatment Plant Operator Level C","Wastewater Treatment Plant Operator Level C","1",214,"Florida Department of Environmental Protection","No","No","No",{"$f":"VLOOKUP(B215,'DOE Codes Lookups'!$A$3:$D$507,2,FALSE)","v":{"$error":"#N/A"}}]
[215,"FLDEP004","(FLDEP004) Water Treatment Plant Operator Level A","Water Treatment Plant Operator Level A","1",215,"Florida Department of Environmental Protection","No","No","No",{"$f":"VLOOKUP(B216,'DOE Codes Lookups'!$A$3:$D$507,2,FALSE)","v":{"$error":"#N/A"}}]
[216,"FLDEP005","(FLDEP005) Water Treatment Plant Operator Level B","Water Treatment Plant Operator Level B","1",216,"Florida Department of Environmental Protection","No","No","No",{"$f":"VLOOKUP(B217,'DOE Codes Lookups'!$A$3:$D$507,2,FALSE)","v":{"$error":"#N/A"}}]
[217,"FLDEP006","(FLDEP006) Water Treatment Plant Operator Level C","Water Treatment Plant Operator Level C","1",217,"Florida Department of Environmental Protection","No","No","No",{"$f":"VLOOKUP(B218,'DOE Codes Lookups'!$A$3:$D$507,2,FALSE)","v":{"$error":"#N/A"}}]
[218,"FLDLE001","(FLDLE001) Auxiliary Law Enforcement Officer","Auxiliary Law Enforcement Officer","1",218,"Florida Department of Law Enforcement, Criminal Justice Standards and Training Commission","No","No","No",{"$f":"VLOOKUP(B219,'DOE Codes Lookups'!$A$3:$D$507,2,FALSE)","v":{"$error":"#N/A"}}]
[219,"FLDLE002","(FLDLE002) Correctional Officer","Correctional Officer","2",219,"Florida Department of Law Enforcement, Criminal Justice Standards and Training Commission","Yes","Yes","Yes",{"$f":"VLOOKUP(B220,'DOE Codes Lookups'!$A$3:$D$507,2,FALSE)","v":{"$error":"#N/A"}}]
[220,"FLDLE003","(FLDLE003) Correctional Probation Officer","Correctional Probation Officer","2",220,"Florida Department of Law Enforcement, Criminal Justice Standards and Training Commission","Yes","Yes","Yes",{"$f":"VLOOKUP(B221,'DOE Codes Lookups'!$A$3:$D$507,2,FALSE)","v":{"$error":"#N/A"}}]
[221,"FLDLE004","(FLDLE004) Law Enforcement Officer","Law Enforcement Officer","2",221,"Florida Department of Law Enforcement, Criminal Justice Standards and Training Commission","Yes","Yes","Yes",{"$f":"VLOOKUP(B222,'DOE Codes Lookups'!$A$3:$D$507,2,FALSE)","v":{"$error":"#N/A"}}]
[222,"FLDOE001","(FLDOE001) Early Childhood Professional Certificate (ECPC)","Early Childhood Professional Certificate (ECPC)","1",222,"Florida Department of Education","No","No","No",{"$f":"VLOOKUP(B223,'DOE Codes Lookups'!$A$3:$D$507,2,FALSE)","v":{"$error":"#N/A"}}]
[223,"FLDOE002","(FLDOE002) School Age Professional Certificate (SAPC)","School Age Professional Certificate (SAPC)","1",223,"Florida Department of Education","No","No","No",{"$f":"VLOOKUP(B224,'DOE Codes Lookups'!$A$3:$D$507,2,FALSE)","v":{"$error":"#N/A"}}]
[224,"FLDOP001","(FLDOP001) Barber","Barber","1",224,"Florida Department of Business and Professional Regulation, Division of Professions","No","No","No",{"$f":"VLOOKUP(B225,'DOE Codes Lookups'!$A$3:$D$507,2,FALSE)","v":{"$error":"#N/A"}}]
[225,"FLDOP002","(FLDOP002) Cosmetologist","Cosmetologist","1",225,"Florida Department of Business and Professional Regulation, Division of Professions","No","No","No",{"$f":"VLOOKUP(B226,'DOE Codes Lookups'!$A$3:$D$507,2,FALSE)","v":{"$error":"#N/A"}}]
[226,"FLDOP007","(FLDOP007) Restricted Barber","Restricted Barber","1",226,"Florida Department of Business and Professional Regulation, Division of Professions","No","No","No",{"$f":"VLOOKUP(B227,'DOE Codes Lookups'!$A$3:$D$507,2,FALSE)","v":{"$error":"#N/A"}}]
[227,"FLDOP008","(FLDOP008) Nail Specialist","Nail Specialist","1",227,"Florida Department of Business and Professional Regulation, Division of Professions","No","No","No",{"$f":"VLOOKUP(B228,'DOE Codes Lookups'!$A$3:$D$507,2,FALSE)","v":{"$error":"#N/A"}}]
[228,"FLDOP009","(FLDOP009) Facial Specialist","Facial Specialist","1",228,"Florida Department of Business and Professional Regulation, Division of Professions","No","No","No",{"$f":"VLOOKUP(B229,'DOE Codes Lookups'!$A$3:$D$507,2,FALSE)","v":{"$error":"#N/A"}}]
[229,"FLDOT001","(FLDOT001) Maintenance of Traffic (MOT) Certification","Maintenance of Traffic (MOT) Certification","1",229,"Florida Department of Transportation","No","No","No",{"$f":"VLOOKUP(B230,'DOE Codes Lookups'!$A$3:$D$507,2,FALSE)","v":{"$error":"#N/A"}}]
[230,"FLFBR001","(FLFBR001) Agritechnology Specialist Certification","Agritechnology Specialist Certification","1",230,"Agricultural Education Services and Technology Inc.","No","No","No",{"$f":"VLOOKUP(B231,'DOE Codes Lookups'!$A$3:$D$507,2,FALSE)","v":{"$error":"#N/A"}}]
[231,"FLFBR005","(FLFBR005) Animal Science Specialist Certification","Animal Science Specialist Certification","1",231,"Agricultural Education Services and Technology Inc.","No","No","No",{"$f":"VLOOKUP(B232,'DOE Codes Lookups'!$A$3:$D$507,2,FALSE)","v":{"$error":"#N/A"}}]
[232,"FLFBR007","(FLFBR007) Agriculture Associate Certification","Agriculture Associate Certification","1",232,"Agricultural Education Services and Technology Inc.","No","No","No",{"$f":"VLOOKUP(B233,'DOE Codes Lookups'!$A$3:$D$507,2,FALSE)","v":{"$error":"#N/A"}}]
[233,"FLSFM002","(FLSFM002) Certified Fire Fighter","Certified Fire Fighter","1",233,"Florida Department of Financial Services, State Fire Marshal, Bureau of Fire Standards & Training","No","No","No",{"$f":"VLOOKUP(B234,'DOE Codes Lookups'!$A$3:$D$507,2,FALSE)","v":{"$error":"#N/A"}}]
[234,"FLSFM005","(FLSFM005) Fire Fighter I","Fire Fighter I","1",234,"Florida Department of Financial Services, State Fire Marshal, Bureau of Fire Standards & Training","No","No","No",{"$f":"VLOOKUP(B235,'DOE Codes Lookups'!$A$3:$D$507,2,FALSE)","v":{"$error":"#N/A"}}]
[235,"FLSFM006","(FLSFM006) Fire Fighter II","Fire Fighter II","2",235,"Florida Department of Financial Services, State Fire Marshal, Bureau of Fire Standards & Training","Yes","Yes","Yes",{"$f":"VLOOKUP(B236,'DOE Codes Lookups'!$A$3:$D$507,2,FALSE)","v":{"$error":"#N/A"}}]
[236,"FLSFM007","(FLSFM007) Fire Safety Inspector I","Fire Safety Inspector I","2",236,"Florida Department of Financial Services, State Fire Marshal, Bureau of Fire Standards & Training","Yes","Yes","Yes",{"$f":"VLOOKUP(B237,'DOE Codes Lookups'!$A$3:$D$507,2,FALSE)","v":{"$error":"#N/A"}}]
[237,"FLSFM013","(FLSFM013) Fire Officer I","Fire Officer I","1",237,"Florida Department of Financial Services, State Fire Marshal, Bureau of Fire Standards & Training","No","No","No",{"$f":"VLOOKUP(B238,'DOE Codes Lookups'!$A$3:$D$507,2,FALSE)","v":{"$error":"#N/A"}}]
[238,"FLSFM014","(FLSFM014) Fire Officer II","Fire Officer II","2",238,"Florida Department of Financial Services, State Fire Marshal, Bureau of Fire Standards & Training","Yes","Yes","Yes",{"$f":"VLOOKUP(B239,'DOE Codes Lookups'!$A$3:$D$507,2,FALSE)","v":{"$error":"#N/A"}}]
[239,"FLSFM016","(FLSFM016) Fire Safety Inspector","Fire Safety Inspector","1",239,"Florida Department of Financial Services, State Fire Marshal, Bureau of Fire Standards & Training","No","No","No",{"$f":"VLOOKUP(B240,'DOE Codes Lookups'!$A$3:$D$507,2,FALSE)","v":{"$error":"#N/A"}}]
[240,"FLSFM018","(FLSFM018) Fire Instructor I","Fire Instructor I","1",240,"Florida Department of Financial Services, State Fire Marshal, Bureau of Fire Standards & Training","No","No","No",{"$f":"VLOOKUP(B241,'DOE Codes Lookups'!$A$3:$D$507,2,FALSE)","v":{"$error":"#N/A"}}]
[241,"FLVMA002","(FLVMA002) Certified Veterinary Assistant (CVA)","Certified Veterinary Assistant (CVA)","1",241,"Florida Veterinary Medical Association","No","No","No",{"$f":"VLOOKUP(B242,'DOE Codes Lookups'!$A$3:$D$507,2,FALSE)","v":{"$error":"#N/A"}}]
[242,"FMAIN001","(FMAIN001) Precision Sheetmetal Operator - Level I (PSMO)","Precision Sheetmetal Operator - Level I (PSMO)","1",242,"Fabricators & Manufacturers Association, International (FMA)","No","No","No",{"$f":"VLOOKUP(B243,'DOE Codes Lookups'!$A$3:$D$507,2,FALSE)","v":{"$error":"#N/A"}}]
[243,"FNGLA001","(FNGLA001) Certified Horticulture Professional","Certified Horticulture Professional","1",243,"Florida Nursery Growers and Landscape Association","No","No","No",{"$f":"VLOOKUP(B244,'DOE Codes Lookups'!$A$3:$D$507,2,FALSE)","v":{"$error":"#N/A"}}]
[244,"FNGLA002","(FNGLA002) Certified Landscape Contractor","Certified Landscape Contractor","1",244,"Florida Nursery Growers and Landscape Association","No","No","No",{"$f":"VLOOKUP(B245,'DOE Codes Lookups'!$A$3:$D$507,2,FALSE)","v":{"$error":"#N/A"}}]
[245,"FNGLA003","(FNGLA003) Certified Landscape Designer","Certified Landscape Designer","1",245,"Florida Nursery Growers and Landscape Association","No","No","No",{"$f":"VLOOKUP(B246,'DOE Codes Lookups'!$A$3:$D$507,2,FALSE)","v":{"$error":"#N/A"}}]
[246,"FNGLA004","(FNGLA004) Certified Landscape Technician","Certified Landscape Technician","1",246,"Florida Nursery Growers and Landscape Association","No","No","No",{"$f":"VLOOKUP(B247,'DOE Codes Lookups'!$A$3:$D$507,2,FALSE)","v":{"$error":"#N/A"}}]
[247,"FPARA001","(FPARA001) Certified Florida Paralegal","Certified Florida Paralegal","1",247,"Paralegal Association of Florida","No","No","No",{"$f":"VLOOKUP(B248,'DOE Codes Lookups'!$A$3:$D$507,2,FALSE)","v":{"$error":"#N/A"}}]
[248,"GLIAC001","(GLIAC001) GIAC Certified Forensic Analyst (GCFA)","GIAC Certified Forensic Analyst (GCFA)","2",248,"Global Information Assurance Certification","Yes","Yes","Yes",{"$f":"VLOOKUP(B249,'DOE Codes Lookups'!$A$3:$D$507,2,FALSE)","v":{"$error":"#N/A"}}]
[249,"GLIAC002","(GLIAC002) GIAC Certified Forensic Examiner (GCFE)","GIAC Certified Forensic Examiner (GCFE)","2",249,"Global Information Assurance Certification","Yes","Yes","Yes",{"$f":"VLOOKUP(B250,'DOE Codes Lookups'!$A$3:$D$507,2,FALSE)","v":{"$error":"#N/A"}}]
[250,"GLIAC003","(GLIAC003) GIAC Certified UNIX Security Administrator (GCUX)","GIAC Certified UNIX Security Administrator (GCUX)","2",250,"Global Information Assurance Certification","Yes","Yes","Yes",{"$f":"VLOOKUP(B251,'DOE Codes Lookups'!$A$3:$D$507,2,FALSE)","v":{"$error":"#N/A"}}]
[251,"GLIAC004","(GLIAC004) GIAC Information Security Fundamentals (GISF)","GIAC Information Security Fundamentals (GISF)","2",251,"Global Information Assurance Certification","Yes","Yes","Yes",{"$f":"VLOOKUP(B252,'DOE Codes Lookups'!$A$3:$D$507,2,FALSE)","v":{"$error":"#N/A"}}]
[252,"GLIAC005","(GLIAC005) GIAC Security Essentials (GSEC)","GIAC Security Essentials (GSEC)","2",252,"Global Information Assurance Certification","Yes","Yes","Yes",{"$f":"VLOOKUP(B253,'DOE Codes Lookups'!$A$3:$D$507,2,FALSE)","v":{"$error":"#N/A"}}]
[253,"GRBCI002","(GRBCI002) LEED Green Associate","LEED Green Associate","1",253,"Green Building Certification Institute","No","No","No",{"$f":"VLOOKUP(B254,'DOE Codes Lookups'!$A$3:$D$507,2,FALSE)","v":{"$error":"#N/A"}}]
[254,"GRBI1002","(GRBI1002) LEED Green Associate","LEED Green Associate","1",254,"US Green Building Council (USGBC)","No","No","No",{"$f":"VLOOKUP(B255,'DOE Codes Lookups'!$A$3:$D$507,2,FALSE)","v":{"$error":"#N/A"}}]
[255,"HBINS003","(HBINS003) HBI Pre-Apprenticeship Certificate Training (PACT), Carpentry","HBI Pre-Apprenticeship Certificate Training (PACT), Carpentry","1",255,"Home Builders Institute","No","No","No",{"$f":"VLOOKUP(B256,'DOE Codes Lookups'!$A$3:$D$507,2,FALSE)","v":{"$error":"#N/A"}}]
[256,"HBINS004","(HBINS004) HBI Pre-Apprenticeship Certificate Training (PACT), Core","HBI Pre-Apprenticeship Certificate Training (PACT), Core","1",256,"Home Builders Institute","No","No","No",{"$f":"VLOOKUP(B257,'DOE Codes Lookups'!$A$3:$D$507,2,FALSE)","v":{"$error":"#N/A"}}]
[257,"HBINS005",{"$f":"CONCATENATE(\"(\",B258,\") \",D258)","v":"(HBINS005) HBI Pre-Apprenticeship Certificate Training (PACT), Core Green"},"HBI Pre-Apprenticeship Certificate Training (PACT), Core Green",{"$f":"IF(H258=\"no\",\"1\",IF(AND(H258=\"Yes\",I258=\"No\",J258=\"No\"),\"3\",IF(AND(H258=\"Yes\",I258=\"Yes\",J258=\"Yes\"),\"2\",IF(AND(H258=\"Yes\",I258=\"Yes\",J258=\"No\"),\"5\",IF(AND(H258=\"Yes\",I258=\"No\",J258=\"Yes\"),\"4\",\"0\")))))","v":"1"},257,"Home Builders Institute",{"$f":"IFERROR(VLOOKUP(B258,PSICFL_1819a,2,FALSE),\"No\")","v":"No"},{"$f":"IFERROR(VLOOKUP(B258,PSICFL_1819a,5,FALSE),\"No\")","v":"No"},{"$f":"IFERROR(VLOOKUP(B258,PSICFL_1819a,3,FALSE),\"No\")","v":"No"},{"$f":"VLOOKUP(B258,'DOE Codes Lookups'!$A$3:$D$507,2,FALSE)","v":{"$error":"#N/A"}}]
[258,"HBINS006","(HBINS006) HBI Pre-Apprenticeship Certificate Training (PACT), Electrical","HBI Pre-Apprenticeship Certificate Training (PACT), Electrical","1",258,"Home Builders Institute","No","No","No",{"$f":"VLOOKUP(B259,'DOE Codes Lookups'!$A$3:$D$507,2,FALSE)","v":{"$error":"#N/A"}}]
[259,"HIMSS001","(HIMSS001) Certified Associate in Healthcare Information & Management Systems","Certified Associate in Healthcare Information & Management Systems","4",259,"Healthcare Information and Management Systems Society (HIMSS) ","Yes","No","Yes",{"$f":"VLOOKUP(B260,'DOE Codes Lookups'!$A$3:$D$507,2,FALSE)","v":{"$error":"#N/A"}}]
[260,"HVACE001","(HVACE001) HVAC Excellence Employment Ready - Heat Pump","HVAC Excellence Employment Ready - Heat Pump","2",260,"HVAC Excellence","Yes","Yes","Yes",{"$f":"VLOOKUP(B261,'DOE Codes Lookups'!$A$3:$D$507,2,FALSE)","v":{"$error":"#N/A"}}]
[261,"HVACE002","(HVACE002) HVAC Excellence EmploymentReady - Air Conditioning","HVAC Excellence EmploymentReady - Air Conditioning","2",261,"HVAC Excellence","Yes","Yes","Yes",{"$f":"VLOOKUP(B262,'DOE Codes Lookups'!$A$3:$D$507,2,FALSE)","v":{"$error":"#N/A"}}]
[262,"HVACE003","(HVACE003) HVAC Excellence Employment Ready - Light Commercial Air Conditioning","HVAC Excellence Employment Ready - Light Commercial Air Conditioning","2",262,"HVAC Excellence","Yes","Yes","Yes",{"$f":"VLOOKUP(B263,'DOE Codes Lookups'!$A$3:$D$507,2,FALSE)","v":{"$error":"#N/A"}}]
[263,"HVACE004","(HVACE004) HVAC Excellence Employment Ready - Electric Heat","HVAC Excellence Employment Ready - Electric Heat","2",263,"HVAC Excellence","Yes","Yes","Yes",{"$f":"VLOOKUP(B264,'DOE Codes Lookups'!$A$3:$D$507,2,FALSE)","v":{"$error":"#N/A"}}]
[264,"HVACE005","(HVACE005) HVAC Excellence Employment Ready - Light Commercial Refrigeration","HVAC Excellence Employment Ready - Light Commercial Refrigeration","2",264,"HVAC Excellence","Yes","Yes","Yes",{"$f":"VLOOKUP(B265,'DOE Codes Lookups'!$A$3:$D$507,2,FALSE)","v":{"$error":"#N/A"}}]
[265,"HVACE006","(HVACE006) HVAC Excellence Employment Ready - Gas Heat","HVAC Excellence Employment Ready - Gas Heat","2",265,"HVAC Excellence","Yes","Yes","Yes",{"$f":"VLOOKUP(B266,'DOE Codes Lookups'!$A$3:$D$507,2,FALSE)","v":{"$error":"#N/A"}}]
[266,"HVACE011","(HVACE011) HVAC Excellence Employment Ready - Electrical","HVAC Excellence Employment Ready - Electrical","2",266,"HVAC Excellence","Yes","Yes","Yes",{"$f":"VLOOKUP(B267,'DOE Codes Lookups'!$A$3:$D$507,2,FALSE)","v":{"$error":"#N/A"}}]
[267,"IACRB001","(IACRB001) Certified Computer Forensics Examiner (CCFE)","Certified Computer Forensics Examiner (CCFE)","1",267,"Information Assurance Certification Review Board","No","No","No",{"$f":"VLOOKUP(B268,'DOE Codes Lookups'!$A$3:$D$507,2,FALSE)","v":{"$error":"#N/A"}}]
[268,"IASSC001","(IASSC001) IASSC Certified Black Belt","IASSC Certified Black Belt","2",268,"International Association For Six Sigma Certification","Yes","Yes","Yes",{"$f":"VLOOKUP(B269,'DOE Codes Lookups'!$A$3:$D$507,2,FALSE)","v":{"$error":"#N/A"}}]
[269,"ICOEC002","(ICOEC002) Certified Ethical Hacker (CEH)","Certified Ethical Hacker (CEH)","2",269,"EC-Council","Yes","Yes","Yes",{"$f":"VLOOKUP(B270,'DOE Codes Lookups'!$A$3:$D$507,2,FALSE)","v":{"$error":"#N/A"}}]
[270,"ICOEC003","(ICOEC003) Computer Hacking Forensic Investigator (CHFI)","Computer Hacking Forensic Investigator (CHFI)","2",270,"EC-Council","Yes","Yes","Yes",{"$f":"VLOOKUP(B271,'DOE Codes Lookups'!$A$3:$D$507,2,FALSE)","v":{"$error":"#N/A"}}]
[271,"ICOEC004","(ICOEC004) Certified Security Analyst (ECSA)","Certified Security Analyst (ECSA)","2",271,"EC-Council","Yes","Yes","Yes",{"$f":"VLOOKUP(B272,'DOE Codes Lookups'!$A$3:$D$507,2,FALSE)","v":{"$error":"#N/A"}}]
[272,"ICOEC005","(ICOEC005) EC-Council Cyber Forensics Associate","EC-Council Cyber Forensics Associate","1",272,"EC-Council","No","No","No",{"$f":"VLOOKUP(B273,'DOE Codes Lookups'!$A$3:$D$507,2,FALSE)","v":{"$error":"#N/A"}}]
[273,"ICOEC006","(ICOEC006) EC-Council Ethical Hacker Associate","EC-Council Ethical Hacker Associate","1",273,"EC-Council","No","No","No",{"$f":"VLOOKUP(B274,'DOE Codes Lookups'!$A$3:$D$507,2,FALSE)","v":{"$error":"#N/A"}}]
[274,"IECON001","(IECON001) Field Service Engineer - Low Voltage Systems","Field Service Engineer - Low Voltage Systems","2",274,"Independent Electrical Contractors","Yes","Yes","Yes",{"$f":"VLOOKUP(B275,'DOE Codes Lookups'!$A$3:$D$507,2,FALSE)","v":{"$error":"#N/A"}}]
[275,"IECON002","(IECON002) Field Service Engineer - Voice-Data-Video","Field Service Engineer - Voice-Data-Video","2",275,"Independent Electrical Contractors","Yes","Yes","Yes",{"$f":"VLOOKUP(B276,'DOE Codes Lookups'!$A$3:$D$507,2,FALSE)","v":{"$error":"#N/A"}}]
[276,"IECON003","(IECON003) Journeyman Electrician","Journeyman Electrician","2",276,"Independent Electrical Contractors","Yes","Yes","Yes",{"$f":"VLOOKUP(B277,'DOE Codes Lookups'!$A$3:$D$507,2,FALSE)","v":{"$error":"#N/A"}}]
[277,"IECON004","(IECON004) Residential Wireman","Residential Wireman","2",277,"Independent Electrical Contractors","Yes","Yes","Yes",{"$f":"VLOOKUP(B278,'DOE Codes Lookups'!$A$3:$D$507,2,FALSE)","v":{"$error":"#N/A"}}]
[278,"IGCEM001","(IGCEM001) Certified Assistant Turf Equipment Technician","Certified Assistant Turf Equipment Technician","1",278,"International Golf Course Equipment Managers Association","No","No","No",{"$f":"VLOOKUP(B279,'DOE Codes Lookups'!$A$3:$D$507,2,FALSE)","v":{"$error":"#N/A"}}]
[279,"IHKBZ001","(IHKBZ001) CNC Production Specialist","CNC Production Specialist","2",279,"IHK-Bildungszentrum","Yes","Yes","Yes",{"$f":"VLOOKUP(B280,'DOE Codes Lookups'!$A$3:$D$507,2,FALSE)","v":{"$error":"#N/A"}}]
[280,"IHKBZ002","(IHKBZ002) Electronics Technician for Industrial Engineering","Electronics Technician for Industrial Engineering","1",280,"IHK-Bildungszentrum","No","No","No",{"$f":"VLOOKUP(B281,'DOE Codes Lookups'!$A$3:$D$507,2,FALSE)","v":{"$error":"#N/A"}}]
[281,"IHKBZ004","(IHKBZ004) Mechatronics Fitter","Mechatronics Fitter","1",281,"IHK-Bildungszentrum","No","No","No",{"$f":"VLOOKUP(B282,'DOE Codes Lookups'!$A$3:$D$507,2,FALSE)","v":{"$error":"#N/A"}}]
[282,"IHKBZ005","(IHKBZ005) Precision Machinist","Precision Machinist","1",282,"IHK-Bildungszentrum","No","No","No",{"$f":"VLOOKUP(B283,'DOE Codes Lookups'!$A$3:$D$507,2,FALSE)","v":{"$error":"#N/A"}}]
[283,"IISSC001","(IISSC001) CISSP- Information Systems Security Management Professional (CISSP-ISSMP)","CISSP- Information Systems Security Management Professional (CISSP-ISSMP)","2",283,"International Information Systems Security Certification Consortium, Inc.","Yes","Yes","Yes",{"$f":"VLOOKUP(B284,'DOE Codes Lookups'!$A$3:$D$507,2,FALSE)","v":{"$error":"#N/A"}}]
[284,"IISSC002","(IISSC002) Systems Security Certified Practitioner (SSCP)","Systems Security Certified Practitioner (SSCP)","2",284,"International Information Systems Security Certification Consortium, Inc.","Yes","Yes","Yes",{"$f":"VLOOKUP(B285,'DOE Codes Lookups'!$A$3:$D$507,2,FALSE)","v":{"$error":"#N/A"}}]
[285,"IISSC003","(IISSC003) Certified Cyber Forensics Professional (CCFP)","Certified Cyber Forensics Professional (CCFP)","2",285,"International Information Systems Security Certification Consortium, Inc.","Yes","Yes","Yes",{"$f":"VLOOKUP(B286,'DOE Codes Lookups'!$A$3:$D$507,2,FALSE)","v":{"$error":"#N/A"}}]
[286,"IISSC004","(IISSC004) Certified Information Systems Security Professional (CISSP)","Certified Information Systems Security Professional (CISSP)","2",286,"International Information Systems Security Certification Consortium, Inc.","Yes","Yes","Yes",{"$f":"VLOOKUP(B287,'DOE Codes Lookups'!$A$3:$D$507,2,FALSE)","v":{"$error":"#N/A"}}]
[287,"INSOC002","(INSOC002) Certified Automation Professional (CAP)","Certified Automation Professional (CAP)","2",287,"International Society of Automation","Yes","Yes","Yes",{"$f":"VLOOKUP(B288,'DOE Codes Lookups'!$A$3:$D$507,2,FALSE)","v":{"$error":"#N/A"}}]
[288,"INSOC005","(INSOC005) Certified Control Systems Technician (CCST) - Level 3","Certified Control Systems Technician (CCST) - Level 3","2",288,"International Society of Automation","Yes","Yes","Yes",{"$f":"VLOOKUP(B289,'DOE Codes Lookups'!$A$3:$D$507,2,FALSE)","v":{"$error":"#N/A"}}]
[289,"INTUT001","(INTUT001) Quickbooks Certified User","Quickbooks Certified User","1",289,"Intuit","No","No","No",{"$f":"VLOOKUP(B290,'DOE Codes Lookups'!$A$3:$D$507,2,FALSE)","v":{"$error":"#N/A"}}]
[290,"IOEEE002","(IOEEE002) Certified Software Development Associate (CSDA)","Certified Software Development Associate (CSDA)","1",290,"IEEE Computer Society","No","No","No",{"$f":"VLOOKUP(B291,'DOE Codes Lookups'!$A$3:$D$507,2,FALSE)","v":{"$error":"#N/A"}}]
[291,"ISCET001","(ISCET001) Associate Level Certified Electronic Technician","Associate Level Certified Electronic Technician","1",291,"International Society for Certified Electronics Technicians","No","No","No",{"$f":"VLOOKUP(B292,'DOE Codes Lookups'!$A$3:$D$507,2,FALSE)","v":{"$error":"#N/A"}}]
[292,"ISCET002","(ISCET002) Electronics System Associate (ESA)","Electronics System Associate (ESA)","2",292,"International Society for Certified Electronics Technicians","Yes","Yes","Yes",{"$f":"VLOOKUP(B293,'DOE Codes Lookups'!$A$3:$D$507,2,FALSE)","v":{"$error":"#N/A"}}]
[293,"JCAHO001","(JCAHO001) Certified Ophthalmic Medical Technologist (COMT)","Certified Ophthalmic Medical Technologist (COMT)","4",293,"Joint Commission on Allied Health Personnel in Ophthalmology (JCAHPO)","Yes","No","Yes",{"$f":"VLOOKUP(B294,'DOE Codes Lookups'!$A$3:$D$507,2,FALSE)","v":{"$error":"#N/A"}}]
[294,"JCAHO002","(JCAHO002) Certified Ophthalmic Technician (COT)","Certified Ophthalmic Technician (COT)","4",294,"Joint Commission on Allied Health Personnel in Ophthalmology (JCAHPO)","Yes","No","Yes",{"$f":"VLOOKUP(B295,'DOE Codes Lookups'!$A$3:$D$507,2,FALSE)","v":{"$error":"#N/A"}}]
[295,"LINPI001","(LINPI001) Linux Essentials 010","Linux Essentials 010","1",295,"Linux Professional Institute","No","No","No",{"$f":"VLOOKUP(B296,'DOE Codes Lookups'!$A$3:$D$507,2,FALSE)","v":{"$error":"#N/A"}}]
[296,"MANSI001","(MANSI001) Manufacturing Technician 1 (MT1)","Manufacturing Technician 1 (MT1)","2",296,"Manufacturing Skills Institute (MSI)","Yes","Yes","Yes",{"$f":"VLOOKUP(B297,'DOE Codes Lookups'!$A$3:$D$507,2,FALSE)","v":{"$error":"#N/A"}}]
[297,"MICRO017","(MICRO017) Microsoft Office Specialist Master","Microsoft Office Specialist Master","1",297,"Microsoft Corporation","No","No","No",{"$f":"VLOOKUP(B298,'DOE Codes Lookups'!$A$3:$D$507,2,FALSE)","v":{"$error":"#N/A"}}]
[298,"MICRO052","(MICRO052) Microsoft Certified Trainer (MCT)","Microsoft Certified Trainer (MCT)","2",298,"Microsoft Corporation","Yes","Yes","Yes",{"$f":"VLOOKUP(B299,'DOE Codes Lookups'!$A$3:$D$507,2,FALSE)","v":{"$error":"#N/A"}}]
[299,"MICRO069","(MICRO069) Microsoft Office Specialist (MOS) Bundle Certification (3 of 6)","Microsoft Office Specialist (MOS) Bundle Certification (3 of 6)","1",299,"Microsoft Corporation","No","No","No",{"$f":"VLOOKUP(B300,'DOE Codes Lookups'!$A$3:$D$507,2,FALSE)","v":{"$error":"#N/A"}}]
[300,"MICRO070","(MICRO070) Microsoft Technology Associate (MTA) - Database Administration Fundamentals","Microsoft Technology Associate (MTA) - Database Administration Fundamentals","1",300,"Microsoft Corporation","No","No","No",{"$f":"VLOOKUP(B301,'DOE Codes Lookups'!$A$3:$D$507,2,FALSE)","v":{"$error":"#N/A"}}]
[301,"MICRO074","(MICRO074) Microsoft Technology Associate (MTA) - Software Development Fundamentals","Microsoft Technology Associate (MTA) - Software Development Fundamentals","1",301,"Microsoft Corporation","No","No","No",{"$f":"VLOOKUP(B302,'DOE Codes Lookups'!$A$3:$D$507,2,FALSE)","v":{"$error":"#N/A"}}]
[302,"MICRO076","(MICRO076) Microsoft Technology Associate (MTA) - Windows OS Fundamentals","Microsoft Technology Associate (MTA) - Windows OS Fundamentals","1",302,"Microsoft Corporation","No","No","No",{"$f":"VLOOKUP(B303,'DOE Codes Lookups'!$A$3:$D$507,2,FALSE)","v":{"$error":"#N/A"}}]
[303,"MICRO077","(MICRO077) Microsoft Technology Associate (MTA) - Security Fundamentals","Microsoft Technology Associate (MTA) - Security Fundamentals","1",303,"Microsoft Corporation","No","No","No",{"$f":"VLOOKUP(B304,'DOE Codes Lookups'!$A$3:$D$507,2,FALSE)","v":{"$error":"#N/A"}}]
[304,"MICRO078","(MICRO078) Microsoft Technology Associate (MTA) - Networking Fundamentals","Microsoft Technology Associate (MTA) - Networking Fundamentals","1",304,"Microsoft Corporation","No","No","No",{"$f":"VLOOKUP(B305,'DOE Codes Lookups'!$A$3:$D$507,2,FALSE)","v":{"$error":"#N/A"}}]
[305,"MICRO080","(MICRO080) Microsoft Technology Associate (MTA) - HTML5 Application Developer Fundamentals","Microsoft Technology Associate (MTA) - HTML5 Application Developer Fundamentals","1",305,"Microsoft Corporation","No","No","No",{"$f":"VLOOKUP(B306,'DOE Codes Lookups'!$A$3:$D$507,2,FALSE)","v":{"$error":"#N/A"}}]
[306,"MICRO082","(MICRO082) Microsoft Certified Solutions Associate (MCSA) - SQL Server 2012","Microsoft Certified Solutions Associate (MCSA) - SQL Server 2012","2",306,"Microsoft Corporation","Yes","Yes","Yes",{"$f":"VLOOKUP(B307,'DOE Codes Lookups'!$A$3:$D$507,2,FALSE)","v":{"$error":"#N/A"}}]
[307,"MICRO085","(MICRO085) Microsoft Certified Solutions Associate (MCSA) - Windows Server 2008","Microsoft Certified Solutions Associate (MCSA) - Windows Server 2008","2",307,"Microsoft Corporation","Yes","Yes","Yes",{"$f":"VLOOKUP(B308,'DOE Codes Lookups'!$A$3:$D$507,2,FALSE)","v":{"$error":"#N/A"}}]
[308,"MICRO086","(MICRO086) Microsoft Certified Solutions Associate (MCSA) - Windows Server 2012","Microsoft Certified Solutions Associate (MCSA) - Windows Server 2012","2",308,"Microsoft Corporation","Yes","Yes","Yes",{"$f":"VLOOKUP(B309,'DOE Codes Lookups'!$A$3:$D$507,2,FALSE)","v":{"$error":"#N/A"}}]
[309,"MICRO089","(MICRO089) Microsoft Certified Solutions Expert (MCSE) - Data Platform","Microsoft Certified Solutions Expert (MCSE) - Data Platform","1",309,"Microsoft Corporation","No","No","No",{"$f":"VLOOKUP(B310,'DOE Codes Lookups'!$A$3:$D$507,2,FALSE)","v":{"$error":"#N/A"}}]
[310,"MICRO101","(MICRO101) Microsoft Technology Associate (MTA) - Software Testing Fundamentals","Microsoft Technology Associate (MTA) - Software Testing Fundamentals","1",310,"Microsoft Corporation","No","No","No",{"$f":"VLOOKUP(B311,'DOE Codes Lookups'!$A$3:$D$507,2,FALSE)","v":{"$error":"#N/A"}}]
[311,"MICRO102","(MICRO102) Microsoft Technology Associate (MTA) - Mobility and Devices Fundamentals","Microsoft Technology Associate (MTA) - Mobility and Devices Fundamentals","1",311,"Microsoft Corporation","No","No","No",{"$f":"VLOOKUP(B312,'DOE Codes Lookups'!$A$3:$D$507,2,FALSE)","v":{"$error":"#N/A"}}]
[312,"MICRO103","(MICRO103) Microsoft Technology Associate (MTA) - Intro Programming Using Block-Based Languages","Microsoft Technology Associate (MTA) - Intro Programming Using Block-Based Languages","1",312,"Microsoft Corporation","No","No","No",{"$f":"VLOOKUP(B313,'DOE Codes Lookups'!$A$3:$D$507,2,FALSE)","v":{"$error":"#N/A"}}]
[313,"MICRO106","(MICRO106) Microsoft Certified Solutions Associate (MCSA) - Windows Server 2016","Microsoft Certified Solutions Associate (MCSA) - Windows Server 2016","2",313,"Microsoft Corporation","Yes","Yes","Yes",{"$f":"VLOOKUP(B314,'DOE Codes Lookups'!$A$3:$D$507,2,FALSE)","v":{"$error":"#N/A"}}]
[314,"MICRO107","(MICRO107) Microsoft Certified Solutions Expert (MCSE) - Data Management and Analytics","Microsoft Certified Solutions Expert (MCSE) - Data Management and Analytics","2",314,"Microsoft Corporation","Yes","Yes","Yes",{"$f":"VLOOKUP(B315,'DOE Codes Lookups'!$A$3:$D$507,2,FALSE)","v":{"$error":"#N/A"}}]
[315,"MICRO108","(MICRO108) Microsoft Certified Solutions Expert (MCSE) - Productivity","Microsoft Certified Solutions Expert (MCSE) - Productivity","2",315,"Microsoft Corporation","Yes","Yes","Yes",{"$f":"VLOOKUP(B316,'DOE Codes Lookups'!$A$3:$D$507,2,FALSE)","v":{"$error":"#N/A"}}]
[316,"MICRO109","(MICRO109) Microsoft Certified Solutions Expert (MCSE) - Cloud Platform and Infrastructure","Microsoft Certified Solutions Expert (MCSE) - Cloud Platform and Infrastructure","2",316,"Microsoft Corporation","Yes","Yes","Yes",{"$f":"VLOOKUP(B317,'DOE Codes Lookups'!$A$3:$D$507,2,FALSE)","v":{"$error":"#N/A"}}]
[317,"MICRO110","(MICRO110) Microsoft Certified Solutions Expert (MCSE) - Mobility","Microsoft Certified Solutions Expert (MCSE) - Mobility","2",317,"Microsoft Corporation","Yes","Yes","Yes",{"$f":"VLOOKUP(B318,'DOE Codes Lookups'!$A$3:$D$507,2,FALSE)","v":{"$error":"#N/A"}}]
[318,"MICRO111","(MICRO111) Microsoft Certified Solutions Developer (MCSD) - App Builder","Microsoft Certified Solutions Developer (MCSD) - App Builder","2",318,"Microsoft Corporation","Yes","Yes","Yes",{"$f":"VLOOKUP(B319,'DOE Codes Lookups'!$A$3:$D$507,2,FALSE)","v":{"$error":"#N/A"}}]
[319,"MICRO112","(MICRO112) Microsoft Technology Associate (MTA) - Introduction to Programming Using Python","Microsoft Technology Associate (MTA) - Introduction to Programming Using Python","1",319,"Microsoft Corporation","No","No","No",{"$f":"VLOOKUP(B320,'DOE Codes Lookups'!$A$3:$D$507,2,FALSE)","v":{"$error":"#N/A"}}]
[320,"MICRO113","(MICRO113) Microsoft Technology Associate (MTA) - Cloud Fundamentals","Microsoft Technology Associate (MTA) - Cloud Fundamentals","1",320,"Microsoft Corporation","No","No","No",{"$f":"VLOOKUP(B321,'DOE Codes Lookups'!$A$3:$D$507,2,FALSE)","v":{"$error":"#N/A"}}]
[321,"MICRO114",{"$f":"CONCATENATE(\"(\",B322,\") \",D322)","v":"(MICRO114) Microsoft Technology Associate (MTA) - Introduction to Programming Using Java"},"Microsoft Technology Associate (MTA) - Introduction to Programming Using Java",{"$f":"IF(H322=\"no\",\"1\",IF(AND(H322=\"Yes\",I322=\"No\",J322=\"No\"),\"3\",IF(AND(H322=\"Yes\",I322=\"Yes\",J322=\"Yes\"),\"2\",IF(AND(H322=\"Yes\",I322=\"Yes\",J322=\"No\"),\"5\",IF(AND(H322=\"Yes\",I322=\"No\",J322=\"Yes\"),\"4\",\"0\")))))","v":"1"},321,"Microsoft Corporation",{"$f":"IFERROR(VLOOKUP(B322,PSICFL_1819a,2,FALSE),\"No\")","v":"No"},{"$f":"IFERROR(VLOOKUP(B322,PSICFL_1819a,5,FALSE),\"No\")","v":"No"},{"$f":"IFERROR(VLOOKUP(B322,PSICFL_1819a,3,FALSE),\"No\")","v":"No"},{"$f":"VLOOKUP(B322,'DOE Codes Lookups'!$A$3:$D$507,2,FALSE)","v":{"$error":"#N/A"}}]
[322,"MICRO115","(MICRO115) Microsoft Technology Associate (MTA) - Windows Server Administration Fundamentals","Microsoft Technology Associate (MTA) - Windows Server Administration Fundamentals","1",322,"Microsoft Corporation","No","No","No",{"$f":"VLOOKUP(B323,'DOE Codes Lookups'!$A$3:$D$507,2,FALSE)","v":{"$error":"#N/A"}}]
[323,"MSSCN001","(MSSCN001) MSSC Certified Production Technician (CPT)","MSSC Certified Production Technician (CPT)","2",323,"Manufacturing Skills Standards Council (MSSC)","Yes","Yes","Yes",{"$f":"VLOOKUP(B324,'DOE Codes Lookups'!$A$3:$D$507,2,FALSE)","v":{"$error":"#N/A"}}]
[324,"MSSCN002","(MSSCN002) MSSC Certified Logistics Technician (CLT)","MSSC Certified Logistics Technician (CLT)","2",324,"Manufacturing Skills Standards Council (MSSC)","Yes","Yes","Yes",{"$f":"VLOOKUP(B325,'DOE Codes Lookups'!$A$3:$D$507,2,FALSE)","v":{"$error":"#N/A"}}]
[325,"NACFS001","(NACFS001) Modeling & Simulation (M&S) Certification","Modeling & Simulation (M&S) Certification","1",325,"National Center for Simulation","No","No","No",{"$f":"VLOOKUP(B326,'DOE Codes Lookups'!$A$3:$D$507,2,FALSE)","v":{"$error":"#N/A"}}]
[326,"NAHUC001","(NAHUC001) Certified Health Unit Coordinator (CHUC)","Certified Health Unit Coordinator (CHUC)","1",326,"National Association of Health Unit Coordinators, Inc.","No","No","No",{"$f":"VLOOKUP(B327,'DOE Codes Lookups'!$A$3:$D$507,2,FALSE)","v":{"$error":"#N/A"}}]
[327,"NASME001","(NASME001) NASM Certified Personal Trainer (CPT)","NASM Certified Personal Trainer (CPT)","4",327,"National Academy of Sports Medicine","Yes","No","Yes",{"$f":"VLOOKUP(B328,'DOE Codes Lookups'!$A$3:$D$507,2,FALSE)","v":{"$error":"#N/A"}}]
[328,"NATEX001","(NATEX001) Air Conditioning Service Technician","Air Conditioning Service Technician","2",328,"North American Technician Excellence","Yes","Yes","Yes",{"$f":"VLOOKUP(B329,'DOE Codes Lookups'!$A$3:$D$507,2,FALSE)","v":{"$error":"#N/A"}}]
[329,"NATEX002","(NATEX002) Air Conditioning Installation Specialization","Air Conditioning Installation Specialization","2",329,"North American Technician Excellence","Yes","Yes","Yes",{"$f":"VLOOKUP(B330,'DOE Codes Lookups'!$A$3:$D$507,2,FALSE)","v":{"$error":"#N/A"}}]
[330,"NATEX003","(NATEX003) Air to Air Heat Pump Installation Technician","Air to Air Heat Pump Installation Technician","2",330,"North American Technician Excellence","Yes","Yes","Yes",{"$f":"VLOOKUP(B331,'DOE Codes Lookups'!$A$3:$D$507,2,FALSE)","v":{"$error":"#N/A"}}]
[331,"NATEX004","(NATEX004) Air to Air Heat Pump Service Technician","Air to Air Heat Pump Service Technician","2",331,"North American Technician Excellence","Yes","Yes","Yes",{"$f":"VLOOKUP(B332,'DOE Codes Lookups'!$A$3:$D$507,2,FALSE)","v":{"$error":"#N/A"}}]
[332,"NATEX006","(NATEX006) NATEX Industry Competency Exam (ICE) - Light Commercial","NATEX Industry Competency Exam (ICE) - Light Commercial","1",332,"North American Technician Excellence","No","No","No",{"$f":"VLOOKUP(B333,'DOE Codes Lookups'!$A$3:$D$507,2,FALSE)","v":{"$error":"#N/A"}}]
[333,"NATHA002","(NATHA002) Certified EKG Technician (CET)","Certified EKG Technician (CET)","2",333,"National Healthcareer Association","Yes","Yes","Yes",{"$f":"VLOOKUP(B334,'DOE Codes Lookups'!$A$3:$D$507,2,FALSE)","v":{"$error":"#N/A"}}]
[334,"NATHA003","(NATHA003) Certified Medical Administrative Assistant (CMAA)","Certified Medical Administrative Assistant (CMAA)","1",334,"National Healthcareer Association","No","No","No",{"$f":"VLOOKUP(B335,'DOE Codes Lookups'!$A$3:$D$507,2,FALSE)","v":{"$error":"#N/A"}}]
[335,"NATHA006","(NATHA006) Certified Patient Care Technician (CPCT)","Certified Patient Care Technician (CPCT)","2",335,"National Healthcareer Association","Yes","Yes","Yes",{"$f":"VLOOKUP(B336,'DOE Codes Lookups'!$A$3:$D$507,2,FALSE)","v":{"$error":"#N/A"}}]
[336,"NATHA007","(NATHA007) Certified Phlebotomy Technician (CPT)","Certified Phlebotomy Technician (CPT)","1",336,"National Healthcareer Association","No","No","No",{"$f":"VLOOKUP(B337,'DOE Codes Lookups'!$A$3:$D$507,2,FALSE)","v":{"$error":"#N/A"}}]
[337,"NATHA008","(NATHA008) Certified Billing & Coding Specialist (CBCS)","Certified Billing & Coding Specialist (CBCS)","2",337,"National Healthcareer Association","Yes","Yes","Yes",{"$f":"VLOOKUP(B338,'DOE Codes Lookups'!$A$3:$D$507,2,FALSE)","v":{"$error":"#N/A"}}]
[338,"NATHA009","(NATHA009) Certified Clinical Medical Assistant (CCMA)","Certified Clinical Medical Assistant (CCMA)","2",338,"National Healthcareer Association","Yes","Yes","Yes",{"$f":"VLOOKUP(B339,'DOE Codes Lookups'!$A$3:$D$507,2,FALSE)","v":{"$error":"#N/A"}}]
[339,"NATHA010","(NATHA010) Certified Pharmacy Technician (CPhT)","Certified Pharmacy Technician (CPhT)","2",339,"National Healthcareer Association","Yes","Yes","Yes",{"$f":"VLOOKUP(B340,'DOE Codes Lookups'!$A$3:$D$507,2,FALSE)","v":{"$error":"#N/A"}}]
[340,"NATHA011","(NATHA011) Certified Electronic Health Record Specialist (CEHRS)","Certified Electronic Health Record Specialist (CEHRS)","1",340,"National Healthcareer Association","No","No","No",{"$f":"VLOOKUP(B341,'DOE Codes Lookups'!$A$3:$D$507,2,FALSE)","v":{"$error":"#N/A"}}]
[341,"NBCHT001","(NBCHT001) Colon Hydrotherapy Certification Exam","Colon Hydrotherapy Certification Exam","1",341,"National Board for Colon Hydrotherapy","No","No","No",{"$f":"VLOOKUP(B342,'DOE Codes Lookups'!$A$3:$D$507,2,FALSE)","v":{"$error":"#N/A"}}]
[342,"NBCOT001","(NBCOT001) Orthopaedic Technologist Certified (OTC)","Orthopaedic Technologist Certified (OTC)","2",342,"National Board for Certification of Orthopaedic Technologists","Yes","Yes","Yes",{"$f":"VLOOKUP(B343,'DOE Codes Lookups'!$A$3:$D$507,2,FALSE)","v":{"$error":"#N/A"}}]
[343,"NBFOT001","(NBFOT001) Certified Occupational Therapy Assistant","Certified Occupational Therapy Assistant","4",343,"National Board for Certification in Occupational Therapy","Yes","No","Yes",{"$f":"VLOOKUP(B344,'DOE Codes Lookups'!$A$3:$D$507,2,FALSE)","v":{"$error":"#N/A"}}]
[344,"NBFRC001","(NBFRC001) Certified Respiratory Therapist (CRT)","Certified Respiratory Therapist (CRT)","4",344,"National Board for Respiratory Care","Yes","No","Yes",{"$f":"VLOOKUP(B345,'DOE Codes Lookups'!$A$3:$D$507,2,FALSE)","v":{"$error":"#N/A"}}]
[345,"NBFRC002","(NBFRC002) Registered Respiratory Therapist (RRT)","Registered Respiratory Therapist (RRT)","4",345,"National Board for Respiratory Care","Yes","No","Yes",{"$f":"VLOOKUP(B346,'DOE Codes Lookups'!$A$3:$D$507,2,FALSE)","v":{"$error":"#N/A"}}]
[346,"NBTMB001","(NBTMB001) Certified Massage Therapist","Certified Massage Therapist","1",346,"National Certification Board of Therapeutic Massage and Bodywork","No","No","No",{"$f":"VLOOKUP(B347,'DOE Codes Lookups'!$A$3:$D$507,2,FALSE)","v":{"$error":"#N/A"}}]
[347,"NCATT001","(NCATT001) Aircraft Electronics Technician (AET) ","Aircraft Electronics Technician (AET) ","2",347,"National Center for Aerospace and Transportation Technologies (NCATT)","Yes","Yes","Yes",{"$f":"VLOOKUP(B348,'DOE Codes Lookups'!$A$3:$D$507,2,FALSE)","v":{"$error":"#N/A"}}]
[348,"NCATT003","(NCATT003) Aerospace / Aircraft Assembly (AAA)","Aerospace / Aircraft Assembly (AAA)","1",348,"National Center for Aerospace and Transportation Technologies (NCATT)","No","No","No",{"$f":"VLOOKUP(B349,'DOE Codes Lookups'!$A$3:$D$507,2,FALSE)","v":{"$error":"#N/A"}}]
[349,"NCCER008","(NCCER008) NCCER Construction Technology (Secondary)","NCCER Construction Technology (Secondary)","1",349,"National Center for Construction Education & Research (NCCER)","No","No","No",{"$f":"VLOOKUP(B350,'DOE Codes Lookups'!$A$3:$D$507,2,FALSE)","v":{"$error":"#N/A"}}]
[350,"NCCER018","(NCCER018) NCCER HVAC - Level 1 (Secondary)","NCCER HVAC - Level 1 (Secondary)","1",350,"National Center for Construction Education & Research (NCCER)","No","No","No",{"$f":"VLOOKUP(B351,'DOE Codes Lookups'!$A$3:$D$507,2,FALSE)","v":{"$error":"#N/A"}}]
[351,"NCCER098","(NCCER098) NCCER Manufactured Construction Technology - Level 1 (Secondary)","NCCER Manufactured Construction Technology - Level 1 (Secondary)","1",351,"National Center for Construction Education & Research (NCCER)","No","No","No",{"$f":"VLOOKUP(B352,'DOE Codes Lookups'!$A$3:$D$507,2,FALSE)","v":{"$error":"#N/A"}}]
[352,"NCCER099","(NCCER099) NCCER Manufactured Construction Technology - Level 2 (Secondary)","NCCER Manufactured Construction Technology - Level 2 (Secondary)","1",352,"National Center for Construction Education & Research (NCCER)","No","No","No",{"$f":"VLOOKUP(B353,'DOE Codes Lookups'!$A$3:$D$507,2,FALSE)","v":{"$error":"#N/A"}}]
[353,"NCCER201","(NCCER201) NCCER Carpentry - Level 1 (Postsecondary)","NCCER Carpentry - Level 1 (Postsecondary)","1",353,"National Center for Construction Education & Research (NCCER)","No","No","No",{"$f":"VLOOKUP(B354,'DOE Codes Lookups'!$A$3:$D$507,2,FALSE)","v":{"$error":"#N/A"}}]
[354,"NCCER202","(NCCER202) NCCER Carpentry - Level 2 (Postsecondary)","NCCER Carpentry - Level 2 (Postsecondary)","1",354,"National Center for Construction Education & Research (NCCER)","No","No","No",{"$f":"VLOOKUP(B355,'DOE Codes Lookups'!$A$3:$D$507,2,FALSE)","v":{"$error":"#N/A"}}]
[355,"NCCER203","(NCCER203) NCCER Carpentry - Level 3 (Postsecondary)","NCCER Carpentry - Level 3 (Postsecondary)","1",355,"National Center for Construction Education & Research (NCCER)","No","No","No",{"$f":"VLOOKUP(B356,'DOE Codes Lookups'!$A$3:$D$507,2,FALSE)","v":{"$error":"#N/A"}}]
[356,"NCCER204","(NCCER204) NCCER Carpentry - Level 4 (Postsecondary)","NCCER Carpentry - Level 4 (Postsecondary)","1",356,"National Center for Construction Education & Research (NCCER)","No","No","No",{"$f":"VLOOKUP(B357,'DOE Codes Lookups'!$A$3:$D$507,2,FALSE)","v":{"$error":"#N/A"}}]
[357,"NCCER205","(NCCER205) NCCER Concrete Finishing - Level 1 (Postsecondary)","NCCER Concrete Finishing - Level 1 (Postsecondary)","1",357,"National Center for Construction Education & Research (NCCER)","No","No","No",{"$f":"VLOOKUP(B358,'DOE Codes Lookups'!$A$3:$D$507,2,FALSE)","v":{"$error":"#N/A"}}]
[358,"NCCER206","(NCCER206) NCCER Concrete Finishing - Level 2 (Postsecondary)","NCCER Concrete Finishing - Level 2 (Postsecondary)","1",358,"National Center for Construction Education & Research (NCCER)","No","No","No",{"$f":"VLOOKUP(B359,'DOE Codes Lookups'!$A$3:$D$507,2,FALSE)","v":{"$error":"#N/A"}}]
[359,"NCCER207","(NCCER207) NCCER Construction Technology (Postsecondary)","NCCER Construction Technology (Postsecondary)","1",359,"National Center for Construction Education & Research (NCCER)","No","No","No",{"$f":"VLOOKUP(B360,'DOE Codes Lookups'!$A$3:$D$507,2,FALSE)","v":{"$error":"#N/A"}}]
[360,"NCCER208","(NCCER208) NCCER Electrical - Level 1 (Postsecondary)","NCCER Electrical - Level 1 (Postsecondary)","1",360,"National Center for Construction Education & Research (NCCER)","No","No","No",{"$f":"VLOOKUP(B361,'DOE Codes Lookups'!$A$3:$D$507,2,FALSE)","v":{"$error":"#N/A"}}]
[361,"NCCER209","(NCCER209) NCCER Electrical - Level 2 (Postsecondary)","NCCER Electrical - Level 2 (Postsecondary)","1",361,"National Center for Construction Education & Research (NCCER)","No","No","No",{"$f":"VLOOKUP(B362,'DOE Codes Lookups'!$A$3:$D$507,2,FALSE)","v":{"$error":"#N/A"}}]
[362,"NCCER210","(NCCER210) NCCER Electrical - Level 3 (Postsecondary)","NCCER Electrical - Level 3 (Postsecondary)","1",362,"National Center for Construction Education & Research (NCCER)","No","No","No",{"$f":"VLOOKUP(B363,'DOE Codes Lookups'!$A$3:$D$507,2,FALSE)","v":{"$error":"#N/A"}}]
[363,"NCCER211","(NCCER211) NCCER Electrical - Level 4 (Postsecondary)","NCCER Electrical - Level 4 (Postsecondary)","2",363,"National Center for Construction Education & Research (NCCER)","Yes","Yes","Yes",{"$f":"VLOOKUP(B364,'DOE Codes Lookups'!$A$3:$D$507,2,FALSE)","v":{"$error":"#N/A"}}]
[364,"NCCER212","(NCCER212) NCCER Electronic Systems Technician - Level 1 (Postsecondary)","NCCER Electronic Systems Technician - Level 1 (Postsecondary)","1",364,"National Center for Construction Education & Research (NCCER)","No","No","No",{"$f":"VLOOKUP(B365,'DOE Codes Lookups'!$A$3:$D$507,2,FALSE)","v":{"$error":"#N/A"}}]
[365,"NCCER213","(NCCER213) NCCER Electronic Systems Technician - Level 2 (Postsecondary)","NCCER Electronic Systems Technician - Level 2 (Postsecondary)","1",365,"National Center for Construction Education & Research (NCCER)","No","No","No",{"$f":"VLOOKUP(B366,'DOE Codes Lookups'!$A$3:$D$507,2,FALSE)","v":{"$error":"#N/A"}}]
[366,"NCCER214","(NCCER214) NCCER Electronic Systems Technician - Level 3 (Postsecondary)","NCCER Electronic Systems Technician - Level 3 (Postsecondary)","1",366,"National Center for Construction Education & Research (NCCER)","No","No","No",{"$f":"VLOOKUP(B367,'DOE Codes Lookups'!$A$3:$D$507,2,FALSE)","v":{"$error":"#N/A"}}]
[367,"NCCER215","(NCCER215) NCCER Electronic Systems Technician - Level 4 (Postsecondary)","NCCER Electronic Systems Technician - Level 4 (Postsecondary)","1",367,"National Center for Construction Education & Research (NCCER)","No","No","No",{"$f":"VLOOKUP(B368,'DOE Codes Lookups'!$A$3:$D$507,2,FALSE)","v":{"$error":"#N/A"}}]
[368,"NCCER216","(NCCER216) NCCER Heavy Equipment Operations - Level 1 (Postsecondary)","NCCER Heavy Equipment Operations - Level 1 (Postsecondary)","1",368,"National Center for Construction Education & Research (NCCER)","No","No","No",{"$f":"VLOOKUP(B369,'DOE Codes Lookups'!$A$3:$D$507,2,FALSE)","v":{"$error":"#N/A"}}]
[369,"NCCER217","(NCCER217) NCCER Heavy Equipment Operations - Level 2 (Postsecondary)","NCCER Heavy Equipment Operations - Level 2 (Postsecondary)","1",369,"National Center for Construction Education & Research (NCCER)","No","No","No",{"$f":"VLOOKUP(B370,'DOE Codes Lookups'!$A$3:$D$507,2,FALSE)","v":{"$error":"#N/A"}}]
[370,"NCCER218","(NCCER218) NCCER Heavy Equipment Operations - Level 3 (Postsecondary)","NCCER Heavy Equipment Operations - Level 3 (Postsecondary)","1",370,"National Center for Construction Education & Research (NCCER)","No","No","No",{"$f":"VLOOKUP(B371,'DOE Codes Lookups'!$A$3:$D$507,2,FALSE)","v":{"$error":"#N/A"}}]
[371,"NCCER219","(NCCER219) NCCER HVAC - Level 1 (Postsecondary)","NCCER HVAC - Level 1 (Postsecondary)","1",371,"National Center for Construction Education & Research (NCCER)","No","No","No",{"$f":"VLOOKUP(B372,'DOE Codes Lookups'!$A$3:$D$507,2,FALSE)","v":{"$error":"#N/A"}}]
[372,"NCCER220","(NCCER220) NCCER HVAC - Level 2 (Postsecondary)","NCCER HVAC - Level 2 (Postsecondary)","1",372,"National Center for Construction Education & Research (NCCER)","No","No","No",{"$f":"VLOOKUP(B373,'DOE Codes Lookups'!$A$3:$D$507,2,FALSE)","v":{"$error":"#N/A"}}]
[373,"NCCER221","(NCCER221) NCCER HVAC - Level 3 (Postsecondary)","NCCER HVAC - Level 3 (Postsecondary)","1",373,"National Center for Construction Education & Research (NCCER)","No","No","No",{"$f":"VLOOKUP(B374,'DOE Codes Lookups'!$A$3:$D$507,2,FALSE)","v":{"$error":"#N/A"}}]
[374,"NCCER222","(NCCER222) NCCER HVAC - Level 4 (Postsecondary)","NCCER HVAC - Level 4 (Postsecondary)","2",374,"National Center for Construction Education & Research (NCCER)","Yes","Yes","Yes",{"$f":"VLOOKUP(B375,'DOE Codes Lookups'!$A$3:$D$507,2,FALSE)","v":{"$error":"#N/A"}}]
[375,"NCCER223","(NCCER223) NCCER Industrial Maintenance Mechanic - Level 1 (Postsecondary)","NCCER Industrial Maintenance Mechanic - Level 1 (Postsecondary)","1",375,"National Center for Construction Education & Research (NCCER)","No","No","No",{"$f":"VLOOKUP(B376,'DOE Codes Lookups'!$A$3:$D$507,2,FALSE)","v":{"$error":"#N/A"}}]
[376,"NCCER224","(NCCER224) NCCER Industrial Maintenance Mechanic - Level 2 (Postsecondary)","NCCER Industrial Maintenance Mechanic - Level 2 (Postsecondary)","1",376,"National Center for Construction Education & Research (NCCER)","No","No","No",{"$f":"VLOOKUP(B377,'DOE Codes Lookups'!$A$3:$D$507,2,FALSE)","v":{"$error":"#N/A"}}]
[377,"NCCER225","(NCCER225) NCCER Industrial Maintenance Mechanic - Level 3 (Postsecondary)","NCCER Industrial Maintenance Mechanic - Level 3 (Postsecondary)","1",377,"National Center for Construction Education & Research (NCCER)","No","No","No",{"$f":"VLOOKUP(B378,'DOE Codes Lookups'!$A$3:$D$507,2,FALSE)","v":{"$error":"#N/A"}}]
[378,"NCCER231","(NCCER231) NCCER Insulating - Level 3 (Postsecondary)","NCCER Insulating - Level 3 (Postsecondary)","1",378,"National Center for Construction Education & Research (NCCER)","No","No","No",{"$f":"VLOOKUP(B379,'DOE Codes Lookups'!$A$3:$D$507,2,FALSE)","v":{"$error":"#N/A"}}]
[379,"NCCER234","(NCCER234) NCCER Ironworking - Level 3 (Postsecondary)","NCCER Ironworking - Level 3 (Postsecondary)","1",379,"National Center for Construction Education & Research (NCCER)","No","No","No",{"$f":"VLOOKUP(B380,'DOE Codes Lookups'!$A$3:$D$507,2,FALSE)","v":{"$error":"#N/A"}}]
[380,"NCCER235","(NCCER235) NCCER Masonry - Level 1 (Postsecondary)","NCCER Masonry - Level 1 (Postsecondary)","1",380,"National Center for Construction Education & Research (NCCER)","No","No","No",{"$f":"VLOOKUP(B381,'DOE Codes Lookups'!$A$3:$D$507,2,FALSE)","v":{"$error":"#N/A"}}]
[381,"NCCER236","(NCCER236) NCCER Masonry - Level 2 (Postsecondary)","NCCER Masonry - Level 2 (Postsecondary)","1",381,"National Center for Construction Education & Research (NCCER)","No","No","No",{"$f":"VLOOKUP(B382,'DOE Codes Lookups'!$A$3:$D$507,2,FALSE)","v":{"$error":"#N/A"}}]
[382,"NCCER237","(NCCER237) NCCER Masonry - Level 3 (Postsecondary)","NCCER Masonry - Level 3 (Postsecondary)","1",382,"National Center for Construction Education & Research (NCCER)","No","No","No",{"$f":"VLOOKUP(B383,'DOE Codes Lookups'!$A$3:$D$507,2,FALSE)","v":{"$error":"#N/A"}}]
[383,"NCCER238","(NCCER238) NCCER Millwright - Level 1 (Postsecondary)","NCCER Millwright - Level 1 (Postsecondary)","1",383,"National Center for Construction Education & Research (NCCER)","No","No","No",{"$f":"VLOOKUP(B384,'DOE Codes Lookups'!$A$3:$D$507,2,FALSE)","v":{"$error":"#N/A"}}]
[384,"NCCER239","(NCCER239) NCCER Millwright - Level 2 (Postsecondary)","NCCER Millwright - Level 2 (Postsecondary)","1",384,"National Center for Construction Education & Research (NCCER)","No","No","No",{"$f":"VLOOKUP(B385,'DOE Codes Lookups'!$A$3:$D$507,2,FALSE)","v":{"$error":"#N/A"}}]
[385,"NCCER240",{"$f":"CONCATENATE(\"(\",B386,\") \",D386)","v":"(NCCER240) NCCER Millwright - Level 3 (Postsecondary)"},"NCCER Millwright - Level 3 (Postsecondary)",{"$f":"IF(H386=\"no\",\"1\",IF(AND(H386=\"Yes\",I386=\"No\",J386=\"No\"),\"3\",IF(AND(H386=\"Yes\",I386=\"Yes\",J386=\"Yes\"),\"2\",IF(AND(H386=\"Yes\",I386=\"Yes\",J386=\"No\"),\"5\",IF(AND(H386=\"Yes\",I386=\"No\",J386=\"Yes\"),\"4\",\"0\")))))","v":"1"},385,"National Center for Construction Education & Research (NCCER)",{"$f":"IFERROR(VLOOKUP(B386,PSICFL_1819a,2,FALSE),\"No\")","v":"No"},{"$f":"IFERROR(VLOOKUP(B386,PSICFL_1819a,5,FALSE),\"No\")","v":"No"},{"$f":"IFERROR(VLOOKUP(B386,PSICFL_1819a,3,FALSE),\"No\")","v":"No"},{"$f":"VLOOKUP(B386,'DOE Codes Lookups'!$A$3:$D$507,2,FALSE)","v":{"$error":"#N/A"}}]
[386,"NCCER241","(NCCER241) NCCER Millwright - Level 4 (Postsecondary)","NCCER Millwright - Level 4 (Postsecondary)","1",386,"National Center for Construction Education & Research (NCCER)","No","No","No",{"$f":"VLOOKUP(B387,'DOE Codes Lookups'!$A$3:$D$507,2,FALSE)","v":{"$error":"#N/A"}}]
[387,"NCCER242","(NCCER242) NCCER Millwright - Level 5 (Postsecondary)","NCCER Millwright - Level 5 (Postsecondary)","1",387,"National Center for Construction Education & Research (NCCER)","No","No","No",{"$f":"VLOOKUP(B388,'DOE Codes Lookups'!$A$3:$D$507,2,FALSE)","v":{"$error":"#N/A"}}]
[388,"NCCER243","(NCCER243) NCCER Painting - Level 1 (Postsecondary)","NCCER Painting - Level 1 (Postsecondary)","1",388,"National Center for Construction Education & Research (NCCER)","No","No","No",{"$f":"VLOOKUP(B389,'DOE Codes Lookups'!$A$3:$D$507,2,FALSE)","v":{"$error":"#N/A"}}]
[389,"NCCER244","(NCCER244) NCCER Painting - Level 2 (Postsecondary)","NCCER Painting - Level 2 (Postsecondary)","1",389,"National Center for Construction Education & Research (NCCER)","No","No","No",{"$f":"VLOOKUP(B390,'DOE Codes Lookups'!$A$3:$D$507,2,FALSE)","v":{"$error":"#N/A"}}]
[390,"NCCER245","(NCCER245) NCCER Painting - Level 3 (Postsecondary)","NCCER Painting - Level 3 (Postsecondary)","1",390,"National Center for Construction Education & Research (NCCER)","No","No","No",{"$f":"VLOOKUP(B391,'DOE Codes Lookups'!$A$3:$D$507,2,FALSE)","v":{"$error":"#N/A"}}]
[391,"NCCER249","(NCCER249) NCCER Pipefitting - Level 4 (Postsecondary)","NCCER Pipefitting - Level 4 (Postsecondary)","5",391,"National Center for Construction Education & Research (NCCER)","Yes","Yes","No",{"$f":"VLOOKUP(B392,'DOE Codes Lookups'!$A$3:$D$507,2,FALSE)","v":{"$error":"#N/A"}}]
[392,"NCCER250","(NCCER250) NCCER Plumbing - Level 1 (Postsecondary)","NCCER Plumbing - Level 1 (Postsecondary)","1",392,"National Center for Construction Education & Research (NCCER)","No","No","No",{"$f":"VLOOKUP(B393,'DOE Codes Lookups'!$A$3:$D$507,2,FALSE)","v":{"$error":"#N/A"}}]
[393,"NCCER251","(NCCER251) NCCER Plumbing - Level 2 (Postsecondary)","NCCER Plumbing - Level 2 (Postsecondary)","1",393,"National Center for Construction Education & Research (NCCER)","No","No","No",{"$f":"VLOOKUP(B394,'DOE Codes Lookups'!$A$3:$D$507,2,FALSE)","v":{"$error":"#N/A"}}]
[394,"NCCER252","(NCCER252) NCCER Plumbing - Level 3 (Postsecondary)","NCCER Plumbing - Level 3 (Postsecondary)","1",394,"National Center for Construction Education & Research (NCCER)","No","No","No",{"$f":"VLOOKUP(B395,'DOE Codes Lookups'!$A$3:$D$507,2,FALSE)","v":{"$error":"#N/A"}}]
[395,"NCCER253","(NCCER253) NCCER Plumbing - Level 4 (Postsecondary)","NCCER Plumbing - Level 4 (Postsecondary)","5",395,"National Center for Construction Education & Research (NCCER)","Yes","Yes","No",{"$f":"VLOOKUP(B396,'DOE Codes Lookups'!$A$3:$D$507,2,FALSE)","v":{"$error":"#N/A"}}]
[396,"NCCER254","(NCCER254) NCCER Project Management (Postsecondary)","NCCER Project Management (Postsecondary)","1",396,"National Center for Construction Education & Research (NCCER)","No","No","No",{"$f":"VLOOKUP(B397,'DOE Codes Lookups'!$A$3:$D$507,2,FALSE)","v":{"$error":"#N/A"}}]
[397,"NCCER255","(NCCER255) NCCER Sheet Metal - Level 1 (Postsecondary)","NCCER Sheet Metal - Level 1 (Postsecondary)","1",397,"National Center for Construction Education & Research (NCCER)","No","No","No",{"$f":"VLOOKUP(B398,'DOE Codes Lookups'!$A$3:$D$507,2,FALSE)","v":{"$error":"#N/A"}}]
[398,"NCCER258","(NCCER258) NCCER Sheet Metal - Level 4 (Postsecondary)","NCCER Sheet Metal - Level 4 (Postsecondary)","1",398,"National Center for Construction Education & Research (NCCER)","No","No","No",{"$f":"VLOOKUP(B399,'DOE Codes Lookups'!$A$3:$D$507,2,FALSE)","v":{"$error":"#N/A"}}]
[399,"NCCER262","(NCCER262) NCCER Sprinkler Fitting Level 4 (Postsecondary)","NCCER Sprinkler Fitting Level 4 (Postsecondary)","1",399,"National Center for Construction Education & Research (NCCER)","No","No","No",{"$f":"VLOOKUP(B400,'DOE Codes Lookups'!$A$3:$D$507,2,FALSE)","v":{"$error":"#N/A"}}]
[400,"NCCER263","(NCCER263) NCCER Welding - Level 1 (Postsecondary)","NCCER Welding - Level 1 (Postsecondary)","1",400,"National Center for Construction Education & Research (NCCER)","No","No","No",{"$f":"VLOOKUP(B401,'DOE Codes Lookups'!$A$3:$D$507,2,FALSE)","v":{"$error":"#N/A"}}]
[401,"NCCER264","(NCCER264) NCCER Welding - Level 2 (Postsecondary)","NCCER Welding - Level 2 (Postsecondary)","1",401,"National Center for Construction Education & Research (NCCER)","No","No","No",{"$f":"VLOOKUP(B402,'DOE Codes Lookups'!$A$3:$D$507,2,FALSE)","v":{"$error":"#N/A"}}]
[402,"NCCER265","(NCCER265) NCCER Welding - Level 3 (Postsecondary)","NCCER Welding - Level 3 (Postsecondary)","2",402,"National Center for Construction Education & Research (NCCER)","Yes","Yes","Yes",{"$f":"VLOOKUP(B403,'DOE Codes Lookups'!$A$3:$D$507,2,FALSE)","v":{"$error":"#N/A"}}]
[403,"NCCER266","(NCCER266) NCCER Industrial Maintenance Mechanic - Level 4 (Postsecondary)","NCCER Industrial Maintenance Mechanic - Level 4 (Postsecondary)","1",403,"National Center for Construction Education & Research (NCCER)","No","No","No",{"$f":"VLOOKUP(B404,'DOE Codes Lookups'!$A$3:$D$507,2,FALSE)","v":{"$error":"#N/A"}}]
[404,"NCCER267","(NCCER267) NCCER Industrial Maintenance, Electrical & Instrumentation Technician - Level 4 (Postsecondary)","NCCER Industrial Maintenance, Electrical & Instrumentation Technician - Level 4 (Postsecondary)","2",404,"National Center for Construction Education & Research (NCCER)","Yes","Yes","Yes",{"$f":"VLOOKUP(B405,'DOE Codes Lookups'!$A$3:$D$507,2,FALSE)","v":{"$error":"#N/A"}}]
[405,"NCDLT001","(NCDLT001) Certified Dental Technician","Certified Dental Technician","1",405,"National Board for Certification in Dental Laboratory Technology","No","No","No",{"$f":"VLOOKUP(B406,'DOE Codes Lookups'!$A$3:$D$507,2,FALSE)","v":{"$error":"#N/A"}}]
[406,"NCFCT001","(NCFCT001) Certified ECG Technician","Certified ECG Technician","1",406,"National Center for Competency Testing","No","No","No",{"$f":"VLOOKUP(B407,'DOE Codes Lookups'!$A$3:$D$507,2,FALSE)","v":{"$error":"#N/A"}}]
[407,"NCFCT003","(NCFCT003) Certified Phlebotomy Technician","Certified Phlebotomy Technician","1",407,"National Center for Competency Testing","No","No","No",{"$f":"VLOOKUP(B408,'DOE Codes Lookups'!$A$3:$D$507,2,FALSE)","v":{"$error":"#N/A"}}]
[408,"NCFCT004","(NCFCT004) Tech in Surgery - Certified (NCCT)","Tech in Surgery - Certified (NCCT)","5",408,"National Center for Competency Testing","Yes","Yes","No",{"$f":"VLOOKUP(B409,'DOE Codes Lookups'!$A$3:$D$507,2,FALSE)","v":{"$error":"#N/A"}}]
[409,"NCFCT005","(NCFCT005) Medical Assistant","Medical Assistant","5",409,"National Center for Competency Testing","Yes","Yes","No",{"$f":"VLOOKUP(B410,'DOE Codes Lookups'!$A$3:$D$507,2,FALSE)","v":{"$error":"#N/A"}}]
[410,"NCFCT006","(NCFCT006) National Certified Insurance and Coding Specialist (NCICS)","National Certified Insurance and Coding Specialist (NCICS)","1",410,"National Center for Competency Testing (NCCT)","No","No","No",{"$f":"VLOOKUP(B411,'DOE Codes Lookups'!$A$3:$D$507,2,FALSE)","v":{"$error":"#N/A"}}]
[411,"NCFCT007","(NCFCT007) National Certified Medical Office Assistant (NCMOA)","National Certified Medical Office Assistant (NCMOA)","1",411,"National Center for Competency Testing (NCCT)","No","No","No",{"$f":"VLOOKUP(B412,'DOE Codes Lookups'!$A$3:$D$507,2,FALSE)","v":{"$error":"#N/A"}}]
[412,"NCFCT008","(NCFCT008) National Certified Patient Care Technician (NCPCT)","National Certified Patient Care Technician (NCPCT)","1",412,"National Center for Competency Testing (NCCT)","No","No","No",{"$f":"VLOOKUP(B413,'DOE Codes Lookups'!$A$3:$D$507,2,FALSE)","v":{"$error":"#N/A"}}]
[413,"NCMCA001","(NCMCA001) Certified Board for Sterile Processing and Distribution","Certified Board for Sterile Processing and Distribution","1",413,"National Commission for Certifying Agencies","No","No","No",{"$f":"VLOOKUP(B414,'DOE Codes Lookups'!$A$3:$D$507,2,FALSE)","v":{"$error":"#N/A"}}]
[414,"NCRAS001","(NCRAS001) Certified Broadcast Captioner","Certified Broadcast Captioner","1",414,"National Court Reporters Association","No","No","No",{"$f":"VLOOKUP(B415,'DOE Codes Lookups'!$A$3:$D$507,2,FALSE)","v":{"$error":"#N/A"}}]
[415,"NCRAS003","(NCRAS003) Professional Reporter","Professional Reporter","1",415,"National Court Reporters Association","No","No","No",{"$f":"VLOOKUP(B416,'DOE Codes Lookups'!$A$3:$D$507,2,FALSE)","v":{"$error":"#N/A"}}]
[416,"NCSAF001","(NCSAF001) Certified Strength Coach","Certified Strength Coach","4",416,"National Council on Strength and Fitness (NCSF)","Yes","No","Yes",{"$f":"VLOOKUP(B417,'DOE Codes Lookups'!$A$3:$D$507,2,FALSE)","v":{"$error":"#N/A"}}]
[417,"NCSAF002","(NCSAF002) Certified Personal Trainer","Certified Personal Trainer","4",417,"National Council on Strength and Fitness (NCSF)","Yes","No","Yes",{"$f":"VLOOKUP(B418,'DOE Codes Lookups'!$A$3:$D$507,2,FALSE)","v":{"$error":"#N/A"}}]
[418,"NCSAF003","(NCSAF003) Sport Nutrition Specialist","Sport Nutrition Specialist","4",418,"National Council on Strength and Fitness (NCSF)","Yes","No","Yes",{"$f":"VLOOKUP(B419,'DOE Codes Lookups'!$A$3:$D$507,2,FALSE)","v":{"$error":"#N/A"}}]
[419,"NCSBN001","(NCSBN001) National Licensed Registered Nurse (NCLEX-RN)","National Licensed Registered Nurse (NCLEX-RN)","4",419,"National Council of State Boards of Nursing","Yes","No","Yes",{"$f":"VLOOKUP(B420,'DOE Codes Lookups'!$A$3:$D$507,2,FALSE)","v":{"$error":"#N/A"}}]
[420,"NCSBN002","(NCSBN002) National Licensed Practical Nurse (NCLEX-PN)","National Licensed Practical Nurse (NCLEX-PN)","2",420,"National Council of State Boards of Nursing","Yes","Yes","Yes",{"$f":"VLOOKUP(B421,'DOE Codes Lookups'!$A$3:$D$507,2,FALSE)","v":{"$error":"#N/A"}}]
[421,"NIASE001","(NIASE001) ASE - Advanced Engine Performance Specialist (L1)","ASE - Advanced Engine Performance Specialist (L1)","2",421,"National Institute for Automotive Service Excellence","Yes","Yes","Yes",{"$f":"VLOOKUP(B422,'DOE Codes Lookups'!$A$3:$D$507,2,FALSE)","v":{"$error":"#N/A"}}]
[422,"NIASE002","(NIASE002) ASE Master Automobile Technician","ASE Master Automobile Technician","1",422,"National Institute for Automotive Service Excellence","No","No","No",{"$f":"VLOOKUP(B423,'DOE Codes Lookups'!$A$3:$D$507,2,FALSE)","v":{"$error":"#N/A"}}]
[423,"NIASE005","(NIASE005) ASE Automobile/Light Truck Technician: Automatic Transmission/Transaxle (A2)","ASE Automobile/Light Truck Technician: Automatic Transmission/Transaxle (A2)","2",423,"National Institute for Automotive Service Excellence","Yes","Yes","Yes",{"$f":"VLOOKUP(B424,'DOE Codes Lookups'!$A$3:$D$507,2,FALSE)","v":{"$error":"#N/A"}}]
[424,"NIASE007","(NIASE007) ASE Automobile/Light Truck Technician: Brakes (A5)","ASE Automobile/Light Truck Technician: Brakes (A5)","2",424,"National Institute for Automotive Service Excellence","Yes","Yes","Yes",{"$f":"VLOOKUP(B425,'DOE Codes Lookups'!$A$3:$D$507,2,FALSE)","v":{"$error":"#N/A"}}]
[425,"NIASE008","(NIASE008) ASE Automobile/Light Truck Technician: Electrical/Electronic Systems (A6)","ASE Automobile/Light Truck Technician: Electrical/Electronic Systems (A6)","2",425,"National Institute for Automotive Service Excellence","Yes","Yes","Yes",{"$f":"VLOOKUP(B426,'DOE Codes Lookups'!$A$3:$D$507,2,FALSE)","v":{"$error":"#N/A"}}]
[426,"NIASE009","(NIASE009) ASE Automobile/Light Truck Technician: Engine Performance (A8)","ASE Automobile/Light Truck Technician: Engine Performance (A8)","2",426,"National Institute for Automotive Service Excellence","Yes","Yes","Yes",{"$f":"VLOOKUP(B427,'DOE Codes Lookups'!$A$3:$D$507,2,FALSE)","v":{"$error":"#N/A"}}]
[427,"NIASE010","(NIASE010) ASE Automobile/Light Truck Technician: Engine Repair (A1)","ASE Automobile/Light Truck Technician: Engine Repair (A1)","2",427,"National Institute for Automotive Service Excellence","Yes","Yes","Yes",{"$f":"VLOOKUP(B428,'DOE Codes Lookups'!$A$3:$D$507,2,FALSE)","v":{"$error":"#N/A"}}]
[428,"NIASE011","(NIASE011) ASE Automobile/Light Truck Technician: Heating and Air Conditioning (A7)","ASE Automobile/Light Truck Technician: Heating and Air Conditioning (A7)","2",428,"National Institute for Automotive Service Excellence","Yes","Yes","Yes",{"$f":"VLOOKUP(B429,'DOE Codes Lookups'!$A$3:$D$507,2,FALSE)","v":{"$error":"#N/A"}}]
[429,"NIASE012","(NIASE012) ASE Automobile/Light Truck Technician: Manual Drive Train and Axles (A3)","ASE Automobile/Light Truck Technician: Manual Drive Train and Axles (A3)","2",429,"National Institute for Automotive Service Excellence","Yes","Yes","Yes",{"$f":"VLOOKUP(B430,'DOE Codes Lookups'!$A$3:$D$507,2,FALSE)","v":{"$error":"#N/A"}}]
[430,"NIASE013","(NIASE013) ASE Automobile Service Consultant (C1)","ASE Automobile Service Consultant (C1)","1",430,"National Institute for Automotive Service Excellence","No","No","No",{"$f":"VLOOKUP(B431,'DOE Codes Lookups'!$A$3:$D$507,2,FALSE)","v":{"$error":"#N/A"}}]
[431,"NIASE014","(NIASE014) ASE Automobile/Light Truck Technician: Suspension and Steering (A4)","ASE Automobile/Light Truck Technician: Suspension and Steering (A4)","2",431,"National Institute for Automotive Service Excellence","Yes","Yes","Yes",{"$f":"VLOOKUP(B432,'DOE Codes Lookups'!$A$3:$D$507,2,FALSE)","v":{"$error":"#N/A"}}]
[432,"NIASE016","(NIASE016) ASE Medium/Heavy Truck Technician: Brakes (T4)","ASE Medium/Heavy Truck Technician: Brakes (T4)","5",432,"National Institute for Automotive Service Excellence","Yes","Yes","No",{"$f":"VLOOKUP(B433,'DOE Codes Lookups'!$A$3:$D$507,2,FALSE)","v":{"$error":"#N/A"}}]
[433,"NIASE017","(NIASE017) ASE Collision Repair and Refinishing Technician: Mechanical and Electrical Components (B5)","ASE Collision Repair and Refinishing Technician: Mechanical and Electrical Components (B5)","2",433,"National Institute for Automotive Service Excellence","Yes","Yes","Yes",{"$f":"VLOOKUP(B434,'DOE Codes Lookups'!$A$3:$D$507,2,FALSE)","v":{"$error":"#N/A"}}]
[434,"NIASE018","(NIASE018) ASE Collision Repair and Refinishing Technician: Non-structural Analysis and Damage Repair (B3)","ASE Collision Repair and Refinishing Technician: Non-structural Analysis and Damage Repair (B3)","2",434,"National Institute for Automotive Service Excellence","Yes","Yes","Yes",{"$f":"VLOOKUP(B435,'DOE Codes Lookups'!$A$3:$D$507,2,FALSE)","v":{"$error":"#N/A"}}]
[435,"NIASE019","(NIASE019) ASE - Damage Analysis and Estimating (B6)","ASE - Damage Analysis and Estimating (B6)","1",435,"National Institute for Automotive Service Excellence","No","No","No",{"$f":"VLOOKUP(B436,'DOE Codes Lookups'!$A$3:$D$507,2,FALSE)","v":{"$error":"#N/A"}}]
[436,"NIASE020","(NIASE020) ASE Medium/Heavy Truck Technician: Diesel Engines (T2)","ASE Medium/Heavy Truck Technician: Diesel Engines (T2)","5",436,"National Institute for Automotive Service Excellence","Yes","Yes","No",{"$f":"VLOOKUP(B437,'DOE Codes Lookups'!$A$3:$D$507,2,FALSE)","v":{"$error":"#N/A"}}]
[437,"NIASE021","(NIASE021) ASE Medium/Heavy Truck Technician: Drive Train (T3)","ASE Medium/Heavy Truck Technician: Drive Train (T3)","5",437,"National Institute for Automotive Service Excellence","Yes","Yes","No",{"$f":"VLOOKUP(B438,'DOE Codes Lookups'!$A$3:$D$507,2,FALSE)","v":{"$error":"#N/A"}}]
[438,"NIASE023","(NIASE023) ASE Medium/Heavy Truck Technician: Electrical/Electronic Systems (T6)","ASE Medium/Heavy Truck Technician: Electrical/Electronic Systems (T6)","5",438,"National Institute for Automotive Service Excellence","Yes","Yes","No",{"$f":"VLOOKUP(B439,'DOE Codes Lookups'!$A$3:$D$507,2,FALSE)","v":{"$error":"#N/A"}}]
[439,"NIASE025","(NIASE025) ASE - Gasoline Engines (T1)","ASE - Gasoline Engines (T1)","5",439,"National Institute for Automotive Service Excellence","Yes","Yes","No",{"$f":"VLOOKUP(B440,'DOE Codes Lookups'!$A$3:$D$507,2,FALSE)","v":{"$error":"#N/A"}}]
[440,"NIASE026","(NIASE026) ASE Medium/Heavy Truck Technician: Heating, Ventilation, and A/C (HVAC) (T7)","ASE Medium/Heavy Truck Technician: Heating, Ventilation, and A/C (HVAC) (T7)","5",440,"National Institute for Automotive Service Excellence","Yes","Yes","No",{"$f":"VLOOKUP(B441,'DOE Codes Lookups'!$A$3:$D$507,2,FALSE)","v":{"$error":"#N/A"}}]
[441,"NIASE029","(NIASE029) ASE Collision Repair and Refinishing Technician: Painting and Refinishing (B2)","ASE Collision Repair and Refinishing Technician: Painting and Refinishing (B2)","2",441,"National Institute for Automotive Service Excellence","Yes","Yes","Yes",{"$f":"VLOOKUP(B442,'DOE Codes Lookups'!$A$3:$D$507,2,FALSE)","v":{"$error":"#N/A"}}]
[442,"NIASE031","(NIASE031) ASE Medium/Heavy Truck Technician: Preventive Maintenance Inspection (PMI) (T8)","ASE Medium/Heavy Truck Technician: Preventive Maintenance Inspection (PMI) (T8)","5",442,"National Institute for Automotive Service Excellence","Yes","Yes","No",{"$f":"VLOOKUP(B443,'DOE Codes Lookups'!$A$3:$D$507,2,FALSE)","v":{"$error":"#N/A"}}]
[443,"NIASE032","(NIASE032) ASE Collision Repair and Refinishing Technician: Structural Analysis and Damage Repair (B4)","ASE Collision Repair and Refinishing Technician: Structural Analysis and Damage Repair (B4)","2",443,"National Institute for Automotive Service Excellence","Yes","Yes","Yes",{"$f":"VLOOKUP(B444,'DOE Codes Lookups'!$A$3:$D$507,2,FALSE)","v":{"$error":"#N/A"}}]
[444,"NIASE033","(NIASE033) ASE Medium/Heavy Truck Technician: Suspension and Steering (T5)","ASE Medium/Heavy Truck Technician: Suspension and Steering (T5)","5",444,"National Institute for Automotive Service Excellence","Yes","Yes","No",{"$f":"VLOOKUP(B445,'DOE Codes Lookups'!$A$3:$D$507,2,FALSE)","v":{"$error":"#N/A"}}]
[445,"NIASE035","(NIASE035) ASE Master Collision Repair and Refinishing Technician","ASE Master Collision Repair and Refinishing Technician","1",445,"National Institute for Automotive Service Excellence","No","No","No",{"$f":"VLOOKUP(B446,'DOE Codes Lookups'!$A$3:$D$507,2,FALSE)","v":{"$error":"#N/A"}}]
[446,"NIASE053","(NIASE053) ASE - Compressed Natural Gas (CNG) Engines (H1)","ASE - Compressed Natural Gas (CNG) Engines (H1)","5",446,"National Institute for Automotive Service Excellence","Yes","Yes","No",{"$f":"VLOOKUP(B447,'DOE Codes Lookups'!$A$3:$D$507,2,FALSE)","v":{"$error":"#N/A"}}]
[447,"NIASE054","(NIASE054) ASE - Diesel Engines (H2)","ASE - Diesel Engines (H2)","5",447,"National Institute for Automotive Service Excellence","Yes","Yes","No",{"$f":"VLOOKUP(B448,'DOE Codes Lookups'!$A$3:$D$507,2,FALSE)","v":{"$error":"#N/A"}}]
[448,"NIASE055","(NIASE055) ASE - Drive Train (H3)","ASE - Drive Train (H3)","5",448,"National Institute for Automotive Service Excellence","Yes","Yes","No",{"$f":"VLOOKUP(B449,'DOE Codes Lookups'!$A$3:$D$507,2,FALSE)","v":{"$error":"#N/A"}}]
[449,"NIASE056",{"$f":"CONCATENATE(\"(\",B450,\") \",D450)","v":"(NIASE056) ASE - Brakes (H4)"},"ASE - Brakes (H4)",{"$f":"IF(H450=\"no\",\"1\",IF(AND(H450=\"Yes\",I450=\"No\",J450=\"No\"),\"3\",IF(AND(H450=\"Yes\",I450=\"Yes\",J450=\"Yes\"),\"2\",IF(AND(H450=\"Yes\",I450=\"Yes\",J450=\"No\"),\"5\",IF(AND(H450=\"Yes\",I450=\"No\",J450=\"Yes\"),\"4\",\"0\")))))","v":"5"},449,"National Institute for Automotive Service Excellence",{"$f":"IFERROR(VLOOKUP(B450,PSICFL_1819a,2,FALSE),\"No\")","v":"Yes"},{"$f":"IFERROR(VLOOKUP(B450,PSICFL_1819a,5,FALSE),\"No\")","v":"Yes"},{"$f":"IFERROR(VLOOKUP(B450,PSICFL_1819a,3,FALSE),\"No\")","v":"No"},{"$f":"VLOOKUP(B450,'DOE Codes Lookups'!$A$3:$D$507,2,FALSE)","v":{"$error":"#N/A"}}]
[450,"NIASE057","(NIASE057) ASE - Suspension and Steering (H5)","ASE - Suspension and Steering (H5)","5",450,"National Institute for Automotive Service Excellence","Yes","Yes","No",{"$f":"VLOOKUP(B451,'DOE Codes Lookups'!$A$3:$D$507,2,FALSE)","v":{"$error":"#N/A"}}]
[451,"NIASE058","(NIASE058) ASE - Electrical/Electronic Systems (H6)","ASE - Electrical/Electronic Systems (H6)","5",451,"National Institute for Automotive Service Excellence","Yes","Yes","No",{"$f":"VLOOKUP(B452,'DOE Codes Lookups'!$A$3:$D$507,2,FALSE)","v":{"$error":"#N/A"}}]
[452,"NIASE059","(NIASE059) ASE - Heating Ventilation and Air Conditioning (HVAC) (H7)","ASE - Heating Ventilation and Air Conditioning (HVAC) (H7)","5",452,"National Institute for Automotive Service Excellence","Yes","Yes","No",{"$f":"VLOOKUP(B453,'DOE Codes Lookups'!$A$3:$D$507,2,FALSE)","v":{"$error":"#N/A"}}]
[453,"NIASE060","(NIASE060) ASE - Preventive Maintenance and Inspection (PMI) (H8)","ASE - Preventive Maintenance and Inspection (PMI) (H8)","5",453,"National Institute for Automotive Service Excellence","Yes","Yes","No",{"$f":"VLOOKUP(B454,'DOE Codes Lookups'!$A$3:$D$507,2,FALSE)","v":{"$error":"#N/A"}}]
[454,"NIASE061","(NIASE061) ASE - Alternate Fuels (F1)","ASE - Alternate Fuels (F1)","2",454,"National Institute for Automotive Service Excellence","Yes","Yes","Yes",{"$f":"VLOOKUP(B455,'DOE Codes Lookups'!$A$3:$D$507,2,FALSE)","v":{"$error":"#N/A"}}]
[455,"NIASE071","(NIASE071) ASE - Light Vehicle Diesel Engines (A9)","ASE - Light Vehicle Diesel Engines (A9)","2",455,"National Institute for Automotive Service Excellence","Yes","Yes","Yes",{"$f":"VLOOKUP(B456,'DOE Codes Lookups'!$A$3:$D$507,2,FALSE)","v":{"$error":"#N/A"}}]
[456,"NIASE076","(NIASE076) ASE Auto Maintenance and Light Repair (G1)","ASE Auto Maintenance and Light Repair (G1)","1",456,"National Institute for Automotive Service Excellence","No","No","No",{"$f":"VLOOKUP(B457,'DOE Codes Lookups'!$A$3:$D$507,2,FALSE)","v":{"$error":"#N/A"}}]
[457,"NIASE094","(NIASE094) ASE Entry-level - Truck: Inspection, Maintenance, and Minor Repair (IM)","ASE Entry-level - Truck: Inspection, Maintenance, and Minor Repair (IM)","1",457,"National Institute for Automotive Service Excellence","No","No","No",{"$f":"VLOOKUP(B458,'DOE Codes Lookups'!$A$3:$D$507,2,FALSE)","v":{"$error":"#N/A"}}]
[458,"NIFMS001","(NIFMS001) NIMS Machining Level I - CNC Milling: Programming Setup & Operations","NIMS Machining Level I - CNC Milling: Programming Setup & Operations","1",458,"National Institute for Metalworking Skills (NIMS)","No","No","No",{"$f":"VLOOKUP(B459,'DOE Codes Lookups'!$A$3:$D$507,2,FALSE)","v":{"$error":"#N/A"}}]
[459,"NIFMS002","(NIFMS002) NIMS Machining Level I - CNC Turning: Programming Setup & Operations","NIMS Machining Level I - CNC Turning: Programming Setup & Operations","1",459,"National Institute for Metalworking Skills (NIMS)","No","No","No",{"$f":"VLOOKUP(B460,'DOE Codes Lookups'!$A$3:$D$507,2,FALSE)","v":{"$error":"#N/A"}}]
[460,"NIFMS003","(NIFMS003) NIMS Machining Level II - EDM - Plunge","NIMS Machining Level II - EDM - Plunge","2",460,"National Institute for Metalworking Skills (NIMS)","Yes","Yes","Yes",{"$f":"VLOOKUP(B461,'DOE Codes Lookups'!$A$3:$D$507,2,FALSE)","v":{"$error":"#N/A"}}]
[461,"NIFMS004","(NIFMS004) NIMS Machining Level II - EDM - Wire","NIMS Machining Level II - EDM - Wire","2",461,"National Institute for Metalworking Skills (NIMS)","Yes","Yes","Yes",{"$f":"VLOOKUP(B462,'DOE Codes Lookups'!$A$3:$D$507,2,FALSE)","v":{"$error":"#N/A"}}]
[462,"NIFMS007","(NIFMS007) NIMS Machining Level II - Manual Milling Skills II","NIMS Machining Level II - Manual Milling Skills II","2",462,"National Institute for Metalworking Skills (NIMS)","Yes","Yes","Yes",{"$f":"VLOOKUP(B463,'DOE Codes Lookups'!$A$3:$D$507,2,FALSE)","v":{"$error":"#N/A"}}]
[463,"NIFMS008","(NIFMS008) NIMS Machining Level I - Turning Operations: Turning Between Centers","NIMS Machining Level I - Turning Operations: Turning Between Centers","1",463,"National Institute for Metalworking Skills (NIMS)","No","No","No",{"$f":"VLOOKUP(B464,'DOE Codes Lookups'!$A$3:$D$507,2,FALSE)","v":{"$error":"#N/A"}}]
[464,"NIFMS010","(NIFMS010) NIMS Machining Level I - Turning Operations: Turning Chucking Skills","NIMS Machining Level I - Turning Operations: Turning Chucking Skills","1",464,"National Institute for Metalworking Skills (NIMS)","No","No","No",{"$f":"VLOOKUP(B465,'DOE Codes Lookups'!$A$3:$D$507,2,FALSE)","v":{"$error":"#N/A"}}]
[465,"NIFMS012","(NIFMS012) NIMS Machining Level II - Grinding Skills II","NIMS Machining Level II - Grinding Skills II","2",465,"National Institute for Metalworking Skills (NIMS)","Yes","Yes","Yes",{"$f":"VLOOKUP(B466,'DOE Codes Lookups'!$A$3:$D$507,2,FALSE)","v":{"$error":"#N/A"}}]
[466,"NIFMS013","(NIFMS013) NIMS Machining Level I - Drill Press Skills I","NIMS Machining Level I - Drill Press Skills I","1",466,"National Institute for Metalworking Skills (NIMS)","No","No","No",{"$f":"VLOOKUP(B467,'DOE Codes Lookups'!$A$3:$D$507,2,FALSE)","v":{"$error":"#N/A"}}]
[467,"NIFMS014","(NIFMS014) NIMS Machining Level I - CNC Milling: Operations","NIMS Machining Level I - CNC Milling: Operations","1",467,"National Institute for Metalworking Skills (NIMS)","No","No","No",{"$f":"VLOOKUP(B468,'DOE Codes Lookups'!$A$3:$D$507,2,FALSE)","v":{"$error":"#N/A"}}]
[468,"NIFMS015","(NIFMS015) NIMS Machining Level I - CNC Turning: Operations","NIMS Machining Level I - CNC Turning: Operations","1",468,"National Institute for Metalworking Skills (NIMS)","No","No","No",{"$f":"VLOOKUP(B469,'DOE Codes Lookups'!$A$3:$D$507,2,FALSE)","v":{"$error":"#N/A"}}]
[469,"NIFMS016","(NIFMS016) NIMS Machining Level I - Grinding Skills I","NIMS Machining Level I - Grinding Skills I","1",469,"National Institute for Metalworking Skills (NIMS)","No","No","No",{"$f":"VLOOKUP(B470,'DOE Codes Lookups'!$A$3:$D$507,2,FALSE)","v":{"$error":"#N/A"}}]
[470,"NIFMS017","(NIFMS017) NIMS Machining Level I - Manual Milling Skills I","NIMS Machining Level I - Manual Milling Skills I","1",470,"National Institute for Metalworking Skills (NIMS)","No","No","No",{"$f":"VLOOKUP(B471,'DOE Codes Lookups'!$A$3:$D$507,2,FALSE)","v":{"$error":"#N/A"}}]
[471,"NIFMS018","(NIFMS018) NIMS Machining Level II - Drill Press Skills II","NIMS Machining Level II - Drill Press Skills II","2",471,"National Institute for Metalworking Skills (NIMS)","Yes","Yes","Yes",{"$f":"VLOOKUP(B472,'DOE Codes Lookups'!$A$3:$D$507,2,FALSE)","v":{"$error":"#N/A"}}]
[472,"NIFMS019","(NIFMS019) NIMS Machining Level II - CNC Milling Skills II","NIMS Machining Level II - CNC Milling Skills II","2",472,"National Institute for Metalworking Skills (NIMS)","Yes","Yes","Yes",{"$f":"VLOOKUP(B473,'DOE Codes Lookups'!$A$3:$D$507,2,FALSE)","v":{"$error":"#N/A"}}]
[473,"NIFMS020","(NIFMS020) NIMS Machining Level II - CNC Turning Skills II","NIMS Machining Level II - CNC Turning Skills II","2",473,"National Institute for Metalworking Skills (NIMS)","Yes","Yes","Yes",{"$f":"VLOOKUP(B474,'DOE Codes Lookups'!$A$3:$D$507,2,FALSE)","v":{"$error":"#N/A"}}]
[474,"NIFMS021","(NIFMS021) NIMS Industrial Technology Maintenance Level 1 Bundle (9 Exams)","NIMS Industrial Technology Maintenance Level 1 Bundle (9 Exams)","2",474,"National Institute for Metalworking Skills","Yes","Yes","Yes",{"$f":"VLOOKUP(B475,'DOE Codes Lookups'!$A$3:$D$507,2,FALSE)","v":{"$error":"#N/A"}}]
[475,"NJATC001","(NJATC001) NJATC Electrical - Level 5","NJATC Electrical - Level 5","2",475,"National Joint Apprenticeship and Training Committee","Yes","Yes","Yes",{"$f":"VLOOKUP(B476,'DOE Codes Lookups'!$A$3:$D$507,2,FALSE)","v":{"$error":"#N/A"}}]
[476,"NMTCB001","(NMTCB001) Certified Nuclear Medicine Technologist","Certified Nuclear Medicine Technologist","4",476,"Nuclear Medicine Technology Certification Board","Yes","No","Yes",{"$f":"VLOOKUP(B477,'DOE Codes Lookups'!$A$3:$D$507,2,FALSE)","v":{"$error":"#N/A"}}]
[477,"NMTCB002","(NMTCB002) Computed Tomography (CT)","Computed Tomography (CT)","4",477,"Nuclear Medicine Technology Certification Board","Yes","No","Yes",{"$f":"VLOOKUP(B478,'DOE Codes Lookups'!$A$3:$D$507,2,FALSE)","v":{"$error":"#N/A"}}]
[478,"NNCCO001","(NNCCO001) Certified Clinical Hemodialysis Technician","Certified Clinical Hemodialysis Technician","2",478,"Nephrology Nursing Certification Commission","Yes","Yes","Yes",{"$f":"VLOOKUP(B479,'DOE Codes Lookups'!$A$3:$D$507,2,FALSE)","v":{"$error":"#N/A"}}]
[479,"NOCTI003","(NOCTI003) NOCTI Apparel and Textile Production and Merchandising","NOCTI Apparel and Textile Production and Merchandising","1",479,"National Occupational Competency Testing Institute (NOCTI)","No","No","No",{"$f":"VLOOKUP(B480,'DOE Codes Lookups'!$A$3:$D$507,2,FALSE)","v":{"$error":"#N/A"}}]
[480,"NOCTI010","(NOCTI010) NOCTI Criminal Justice","NOCTI Criminal Justice","1",480,"National Occupational Competency Testing Institute (NOCTI)","No","No","No",{"$f":"VLOOKUP(B481,'DOE Codes Lookups'!$A$3:$D$507,2,FALSE)","v":{"$error":"#N/A"}}]
[481,"NOCTI013","(NOCTI013) NOCTI Television Production","NOCTI Television Production","1",481,"National Occupational Competency Testing Institute (NOCTI)","No","No","No",{"$f":"VLOOKUP(B482,'DOE Codes Lookups'!$A$3:$D$507,2,FALSE)","v":{"$error":"#N/A"}}]
[482,"NOCTI015","(NOCTI015) NOCTI Accounting Basic","NOCTI Accounting Basic","1",482,"National Occupational Competency Testing Institute (NOCTI)","No","No","No",{"$f":"VLOOKUP(B483,'DOE Codes Lookups'!$A$3:$D$507,2,FALSE)","v":{"$error":"#N/A"}}]
[483,"NOCTI019","(NOCTI019) NOCTI Cabinetmaking","NOCTI Cabinetmaking","1",483,"National Occupational Competency Testing Institute (NOCTI)","No","No","No",{"$f":"VLOOKUP(B484,'DOE Codes Lookups'!$A$3:$D$507,2,FALSE)","v":{"$error":"#N/A"}}]
[484,"NRAEF001","(NRAEF001) Foodservice Management Professional (FMP)","Foodservice Management Professional (FMP)","1",484,"National Restaurant Association Educational Foundation","No","No","No",{"$f":"VLOOKUP(B485,'DOE Codes Lookups'!$A$3:$D$507,2,FALSE)","v":{"$error":"#N/A"}}]
[485,"NRAEF002","(NRAEF002) National ProStart Certificate of Achievement","National ProStart Certificate of Achievement","1",485,"National Restaurant Association Educational Foundation","No","No","No",{"$f":"VLOOKUP(B486,'DOE Codes Lookups'!$A$3:$D$507,2,FALSE)","v":{"$error":"#N/A"}}]
[486,"NRAEF003","(NRAEF003) Certified Food Protection Manager (ServSafe®)","Certified Food Protection Manager (ServSafe®)","1",486,"National Restaurant Association Educational Foundation","No","No","No",{"$f":"VLOOKUP(B487,'DOE Codes Lookups'!$A$3:$D$507,2,FALSE)","v":{"$error":"#N/A"}}]
[487,"NREMT001","(NREMT001) Emergency Medical Technician (EMT)","Emergency Medical Technician (EMT)","2",487,"National Registry of Emergency Medical Technicians","Yes","Yes","Yes",{"$f":"VLOOKUP(B488,'DOE Codes Lookups'!$A$3:$D$507,2,FALSE)","v":{"$error":"#N/A"}}]
[488,"NREMT004","(NREMT004) Paramedic (EMT-P)","Paramedic (EMT-P)","1",488,"National Registry of Emergency Medical Technicians","No","No","No",{"$f":"VLOOKUP(B489,'DOE Codes Lookups'!$A$3:$D$507,2,FALSE)","v":{"$error":"#N/A"}}]
[489,"NRFSP001","(NRFSP001) Certified Food Safety Manager","Certified Food Safety Manager","1",489,"National Registry of Food Safety Professionals","No","No","No",{"$f":"VLOOKUP(B490,'DOE Codes Lookups'!$A$3:$D$507,2,FALSE)","v":{"$error":"#N/A"}}]
[490,"NRFSP002","(NRFSP002) HACCP Certification","HACCP Certification","1",490,"National Registry of Food Safety Professionals","No","No","No",{"$f":"VLOOKUP(B491,'DOE Codes Lookups'!$A$3:$D$507,2,FALSE)","v":{"$error":"#N/A"}}]
[491,"NSTSA001","(NSTSA001) Certified Surgical Technologist (CST)","Certified Surgical Technologist (CST)","2",491,"National Board of Surgical Technologist and Surgical Assisting","Yes","Yes","Yes",{"$f":"VLOOKUP(B492,'DOE Codes Lookups'!$A$3:$D$507,2,FALSE)","v":{"$error":"#N/A"}}]
[492,"NSTSA002","(NSTSA002) Certified Surgical First Assistant (CSFA)","Certified Surgical First Assistant (CSFA)","4",492,"National Board of Surgical Technologist and Surgical Assisting","Yes","No","Yes",{"$f":"VLOOKUP(B493,'DOE Codes Lookups'!$A$3:$D$507,2,FALSE)","v":{"$error":"#N/A"}}]
[493,"ORACL001","(ORACL001) Oracle Certified Associate (OCA): Database","Oracle Certified Associate (OCA): Database","2",493,"Oracle Corporation","Yes","Yes","Yes",{"$f":"VLOOKUP(B494,'DOE Codes Lookups'!$A$3:$D$507,2,FALSE)","v":{"$error":"#N/A"}}]
[494,"ORACL002","(ORACL002) Oracle Certified Professional (OCP): Database","Oracle Certified Professional (OCP): Database","2",494,"Oracle Corporation","Yes","Yes","Yes",{"$f":"VLOOKUP(B495,'DOE Codes Lookups'!$A$3:$D$507,2,FALSE)","v":{"$error":"#N/A"}}]
[495,"ORACL003","(ORACL003) Oracle Certified Master (OCM): Database","Oracle Certified Master (OCM): Database","2",495,"Oracle Corporation","Yes","Yes","Yes",{"$f":"VLOOKUP(B496,'DOE Codes Lookups'!$A$3:$D$507,2,FALSE)","v":{"$error":"#N/A"}}]
[496,"ORACL004","(ORACL004) Oracle Certified Associate (OCA): Java Programmer","Oracle Certified Associate (OCA): Java Programmer","2",496,"Oracle Corporation","Yes","Yes","Yes",{"$f":"VLOOKUP(B497,'DOE Codes Lookups'!$A$3:$D$507,2,FALSE)","v":{"$error":"#N/A"}}]
[497,"ORACL005","(ORACL005) Oracle Certified Professional (OCP): Java Programmer","Oracle Certified Professional (OCP): Java Programmer","2",497,"Oracle Corporation","Yes","Yes","Yes",{"$f":"VLOOKUP(B498,'DOE Codes Lookups'!$A$3:$D$507,2,FALSE)","v":{"$error":"#N/A"}}]
[498,"ORACL006","(ORACL006) Oracle Certified Master (OCM): Java Developer","Oracle Certified Master (OCM): Java Developer","2",498,"Oracle Corporation","Yes","Yes","Yes",{"$f":"VLOOKUP(B499,'DOE Codes Lookups'!$A$3:$D$507,2,FALSE)","v":{"$error":"#N/A"}}]
[499,"ORACL007","(ORACL007) Oracle Certified Expert (OCE): Database SQL","Oracle Certified Expert (OCE): Database SQL","1",499,"Oracle Corporation","No","No","No",{"$f":"VLOOKUP(B500,'DOE Codes Lookups'!$A$3:$D$507,2,FALSE)","v":{"$error":"#N/A"}}]
[500,"PRMIN001","(PRMIN001) Project Management Professional (PMP)","Project Management Professional (PMP)","1",500,"Project Management Institute","No","No","No",{"$f":"VLOOKUP(B501,'DOE Codes Lookups'!$A$3:$D$507,2,FALSE)","v":{"$error":"#N/A"}}]
[501,"PRMIN003","(PRMIN003) Certified Associate in Project Management (CAPM)","Certified Associate in Project Management (CAPM)","1",501,"Project Management Institute","No","No","No",{"$f":"VLOOKUP(B502,'DOE Codes Lookups'!$A$3:$D$507,2,FALSE)","v":{"$error":"#N/A"}}]
[502,"PROSO003","(PROSO003) Certified Internet Web (CIW) E-Commerce Specialist","Certified Internet Web (CIW) E-Commerce Specialist","2",502,"Certification Partners","Yes","Yes","Yes",{"$f":"VLOOKUP(B503,'DOE Codes Lookups'!$A$3:$D$507,2,FALSE)","v":{"$error":"#N/A"}}]
[503,"PROSO006","(PROSO006) Certified Internet Web (CIW) Database Design Specialist","Certified Internet Web (CIW) Database Design Specialist","2",503,"Certification Partners","Yes","Yes","Yes",{"$f":"VLOOKUP(B504,'DOE Codes Lookups'!$A$3:$D$507,2,FALSE)","v":{"$error":"#N/A"}}]
[504,"PROSO010","(PROSO010) Certified Internet Web (CIW) Web Security Professional","Certified Internet Web (CIW) Web Security Professional","2",504,"Certification Partners","Yes","Yes","Yes",{"$f":"VLOOKUP(B505,'DOE Codes Lookups'!$A$3:$D$507,2,FALSE)","v":{"$error":"#N/A"}}]
[505,"PROSO016","(PROSO016) Certified Internet Web (CIW) Internet Business Associate","Certified Internet Web (CIW) Internet Business Associate","1",505,"Certification Partners","No","No","No",{"$f":"VLOOKUP(B506,'DOE Codes Lookups'!$A$3:$D$507,2,FALSE)","v":{"$error":"#N/A"}}]
[506,"PROSO017","(PROSO017) Certified Internet Web (CIW) JavaScript Specialist","Certified Internet Web (CIW) JavaScript Specialist","2",506,"Certification Partners","Yes","Yes","Yes",{"$f":"VLOOKUP(B507,'DOE Codes Lookups'!$A$3:$D$507,2,FALSE)","v":{"$error":"#N/A"}}]
[507,"PROSO018","(PROSO018) Certified Internet Web (CIW) Network Technology Associate","Certified Internet Web (CIW) Network Technology Associate","1",507,"Certification Partners","No","No","No",{"$f":"VLOOKUP(B508,'DOE Codes Lookups'!$A$3:$D$507,2,FALSE)","v":{"$error":"#N/A"}}]
[508,"PROSO019","(PROSO019) Certified Internet Web (CIW) Perl Specialist","Certified Internet Web (CIW) Perl Specialist","2",508,"Certification Partners","Yes","Yes","Yes",{"$f":"VLOOKUP(B509,'DOE Codes Lookups'!$A$3:$D$507,2,FALSE)","v":{"$error":"#N/A"}}]
[509,"PROSO020","(PROSO020) Certified Internet Web (CIW) Site Development Associate","Certified Internet Web (CIW) Site Development Associate","1",509,"Certification Partners","No","No","No",{"$f":"VLOOKUP(B510,'DOE Codes Lookups'!$A$3:$D$507,2,FALSE)","v":{"$error":"#N/A"}}]
[510,"PROSO021","(PROSO021) Certified Internet Web (CIW) Web Design Professional","Certified Internet Web (CIW) Web Design Professional","2",510,"Certification Partners","Yes","Yes","Yes",{"$f":"VLOOKUP(B511,'DOE Codes Lookups'!$A$3:$D$507,2,FALSE)","v":{"$error":"#N/A"}}]
[511,"PROSO022","(PROSO022) Certified Internet Web (CIW) Web Design Specialist","Certified Internet Web (CIW) Web Design Specialist","2",511,"Certification Partners","Yes","Yes","Yes",{"$f":"VLOOKUP(B512,'DOE Codes Lookups'!$A$3:$D$507,2,FALSE)","v":{"$error":"#N/A"}}]
[512,"PROSO023","(PROSO023) Certified Internet Web (CIW) Web Development Professional","Certified Internet Web (CIW) Web Development Professional","2",512,"Certification Partners","Yes","Yes","Yes",{"$f":"VLOOKUP(B513,'DOE Codes Lookups'!$A$3:$D$507,2,FALSE)","v":{"$error":"#N/A"}}]
[513,"PROSO024",{"$f":"CONCATENATE(\"(\",B514,\") \",D514)","v":"(PROSO024) Certified Internet Web (CIW) Web Foundations Associate"},"Certified Internet Web (CIW) Web Foundations Associate",{"$f":"IF(H514=\"no\",\"1\",IF(AND(H514=\"Yes\",I514=\"No\",J514=\"No\"),\"3\",IF(AND(H514=\"Yes\",I514=\"Yes\",J514=\"Yes\"),\"2\",IF(AND(H514=\"Yes\",I514=\"Yes\",J514=\"No\"),\"5\",IF(AND(H514=\"Yes\",I514=\"No\",J514=\"Yes\"),\"4\",\"0\")))))","v":"1"},513,"Certification Partners",{"$f":"IFERROR(VLOOKUP(B514,PSICFL_1819a,2,FALSE),\"No\")","v":"No"},{"$f":"IFERROR(VLOOKUP(B514,PSICFL_1819a,5,FALSE),\"No\")","v":"No"},{"$f":"IFERROR(VLOOKUP(B514,PSICFL_1819a,3,FALSE),\"No\")","v":"No"},{"$f":"VLOOKUP(B514,'DOE Codes Lookups'!$A$3:$D$507,2,FALSE)","v":{"$error":"#N/A"}}]
[514,"PROSO025","(PROSO025) Certified Internet Web (CIW) Web Security Associate","Certified Internet Web (CIW) Web Security Associate","1",514,"Certification Partners","No","No","No",{"$f":"VLOOKUP(B515,'DOE Codes Lookups'!$A$3:$D$507,2,FALSE)","v":{"$error":"#N/A"}}]
[515,"PROSO026","(PROSO026) Certified Internet Web (CIW) Web Security Specialist","Certified Internet Web (CIW) Web Security Specialist","2",515,"Certification Partners","Yes","Yes","Yes",{"$f":"VLOOKUP(B516,'DOE Codes Lookups'!$A$3:$D$507,2,FALSE)","v":{"$error":"#N/A"}}]
[516,"PROSO027","(PROSO027) Certified Internet Web (CIW) Advanced HTML5 & CSS3 Specialist","Certified Internet Web (CIW) Advanced HTML5 & CSS3 Specialist","2",516,"Certification Partners","Yes","Yes","Yes",{"$f":"VLOOKUP(B517,'DOE Codes Lookups'!$A$3:$D$507,2,FALSE)","v":{"$error":"#N/A"}}]
[517,"PROSO028","(PROSO028) Certified Internet Web (CIW) Data Analyst","Certified Internet Web (CIW) Data Analyst","1",517,"Certification Partners","No","No","No",{"$f":"VLOOKUP(B518,'DOE Codes Lookups'!$A$3:$D$507,2,FALSE)","v":{"$error":"#N/A"}}]
[518,"PROSO029","(PROSO029) Certified Internet Web (CIW) User Interface Designer","Certified Internet Web (CIW) User Interface Designer","1",518,"Certification Partners","No","No","No",{"$f":"VLOOKUP(B519,'DOE Codes Lookups'!$A$3:$D$507,2,FALSE)","v":{"$error":"#N/A"}}]
[519,"PROSO030","(PROSO030) Certified Internet Web (CIW) Data Analyst Specialist","Certified Internet Web (CIW) Data Analyst Specialist","1",519,"Certification Partners","No","No","No",{"$f":"VLOOKUP(B520,'DOE Codes Lookups'!$A$3:$D$507,2,FALSE)","v":{"$error":"#N/A"}}]
[520,"PROSO031","(PROSO031) Certified Internet Web (CIW) Social Media Strategist","Certified Internet Web (CIW) Social Media Strategist","1",520,"Certification Partners","No","No","No",{"$f":"VLOOKUP(B521,'DOE Codes Lookups'!$A$3:$D$507,2,FALSE)","v":{"$error":"#N/A"}}]
[521,"PROSO032","(PROSO032) Certified Internet Web (CIW) User Interface Designer","Certified Internet Web (CIW) User Interface Designer","1",521,"Certification Partners","No","No","No",{"$f":"VLOOKUP(B522,'DOE Codes Lookups'!$A$3:$D$507,2,FALSE)","v":{"$error":"#N/A"}}]
[522,"PTCBD001","(PTCBD001) Pharmacy Technician","Pharmacy Technician","2",522,"Pharmacy Technician Certification Board","Yes","Yes","Yes",{"$f":"VLOOKUP(B523,'DOE Codes Lookups'!$A$3:$D$507,2,FALSE)","v":{"$error":"#N/A"}}]
[523,"SALES001","(SALES001) Salesforce Certified Administrator","Salesforce Certified Administrator","1",523,"Salesforce","No","No","No",{"$f":"VLOOKUP(B524,'DOE Codes Lookups'!$A$3:$D$507,2,FALSE)","v":{"$error":"#N/A"}}]
[524,"SMFEN001","(SMFEN001) Lean Bronze Certification (LBC)","Lean Bronze Certification (LBC)","2",524,"Society of Manufacturing Engineers","Yes","Yes","Yes",{"$f":"VLOOKUP(B525,'DOE Codes Lookups'!$A$3:$D$507,2,FALSE)","v":{"$error":"#N/A"}}]
[525,"SMRPR001","(SMRPR001) Certified Maintenance and Reliability Professional (CMRP)","Certified Maintenance and Reliability Professional (CMRP)","2",525,"Society for Maintenance and Reliability Professionals","Yes","Yes","Yes",{"$f":"VLOOKUP(B526,'DOE Codes Lookups'!$A$3:$D$507,2,FALSE)","v":{"$error":"#N/A"}}]
[526,"SOCTE004","(SOCTE004) Broadband Premises Installer (BPI)","Broadband Premises Installer (BPI)","1",526,"Society of Cable Telecommunications Engineers","No","No","No",{"$f":"VLOOKUP(B527,'DOE Codes Lookups'!$A$3:$D$507,2,FALSE)","v":{"$error":"#N/A"}}]
[527,"SOLID003","(SOLID003) Certified Solidworks Associate-Academic (CSWA-Academic)","Certified Solidworks Associate-Academic (CSWA-Academic)","1",527,"Dassault Systems Solidworks Corporation","No","No","No",{"$f":"VLOOKUP(B528,'DOE Codes Lookups'!$A$3:$D$507,2,FALSE)","v":{"$error":"#N/A"}}]
[528,"SOLID004","(SOLID004) Certified Solidworks Professional-Academic (CSWP-Academic)","Certified Solidworks Professional-Academic (CSWP-Academic)","2",528,"Dassault Systems Solidworks Corporation","Yes","Yes","Yes",{"$f":"VLOOKUP(B529,'DOE Codes Lookups'!$A$3:$D$507,2,FALSE)","v":{"$error":"#N/A"}}]
[529,"SPACE001","(SPACE001) Aerospace Technician","Aerospace Technician","2",529,"SpaceTec","Yes","Yes","Yes",{"$f":"VLOOKUP(B530,'DOE Codes Lookups'!$A$3:$D$507,2,FALSE)","v":{"$error":"#N/A"}}]
[530,"TAFLP001","(TAFLP001) Accredited Legal Professional (ALP)","Accredited Legal Professional (ALP)","1",530,"NALS…the Association for Legal Professionals","No","No","No",{"$f":"VLOOKUP(B531,'DOE Codes Lookups'!$A$3:$D$507,2,FALSE)","v":{"$error":"#N/A"}}]
[531,"TAFLP002","(TAFLP002) Professional Legal Secretary (PLS)","Professional Legal Secretary (PLS)","1",531,"NALS…the Association for Legal Professionals","No","No","No",{"$f":"VLOOKUP(B532,'DOE Codes Lookups'!$A$3:$D$507,2,FALSE)","v":{"$error":"#N/A"}}]
[532,"TAFOM001","(TAFOM001) Certified in Production and Inventory Management (CPIM) ","Certified in Production and Inventory Management (CPIM) ","2",532,"American Production and Inventory Control Society (APICS)","Yes","Yes","Yes",{"$f":"VLOOKUP(B533,'DOE Codes Lookups'!$A$3:$D$507,2,FALSE)","v":{"$error":"#N/A"}}]
[533,"TBOOM001","(TBOOM001) Toon Boom Certified Associate (Harmony Premium)","Toon Boom Certified Associate (Harmony Premium)","1",533,"Toon Boom Animation","No","No","No",{"$f":"VLOOKUP(B534,'DOE Codes Lookups'!$A$3:$D$507,2,FALSE)","v":{"$error":"#N/A"}}]
[534,"TBOOM003","(TBOOM003) Toon Boom Certified Associate (Storyboard Pro)","Toon Boom Certified Associate (Storyboard Pro)","1",534,"Toon Boom Animation","No","No","No",{"$f":"VLOOKUP(B535,'DOE Codes Lookups'!$A$3:$D$507,2,FALSE)","v":{"$error":"#N/A"}}]
[535,"UNITY001","(UNITY001) Unity Certified Associate","Unity Certified Associate","1",535,"Unity Technologies","No","No","No",{"$f":"VLOOKUP(B536,'DOE Codes Lookups'!$A$3:$D$507,2,FALSE)","v":{"$error":"#N/A"}}]
[536,"UNITY002","(UNITY002) Unity Certified User: Programmer","Unity Certified User: Programmer","1",536,"Unity Technologies","No","No","No",{"$f":"VLOOKUP(B537,'DOE Codes Lookups'!$A$3:$D$507,2,FALSE)","v":{"$error":"#N/A"}}]
[537,"USINS001","(USINS001) Small UAS Safety Certification","Small UAS Safety Certification","1",537,"Unmanned Safety Institute","No","No","No",{"$f":"VLOOKUP(B538,'DOE Codes Lookups'!$A$3:$D$507,2,FALSE)","v":{"$error":"#N/A"}}]
[538,"VMWRE004","(VMWRE004) VMware Certified Professional - Data Center Virtualization","VMware Certified Professional - Data Center Virtualization","2",538,"VMWare","Yes","Yes","Yes",{"$f":"VLOOKUP(B539,'DOE Codes Lookups'!$A$3:$D$507,2,FALSE)","v":{"$error":"#N/A"}}]
[null,null,"() ",null,"1",null,null,"No","No","No",{"$f":"VLOOKUP(B540,'DOE Codes Lookups'!$A$3:$D$507,2,FALSE)","v":{"$error":"#N/A"}}]
[null,null,"() ",null,"1",null,null,"No","No","No",{"$f":"VLOOKUP(B541,'DOE Codes Lookups'!$A$3:$D$507,2,FALSE)","v":{"$error":"#N/A"}}]
[null,null,"() ",null,"1",null,null,"No","No","No",{"$f":"VLOOKUP(B542,'DOE Codes Lookups'!$A$3:$D$507,2,FALSE)","v":{"$error":"#N/A"}}]
[null,null,"() ",null,"1",null,null,"No","No","No",{"$f":"VLOOKUP(B543,'DOE Codes Lookups'!$A$3:$D$507,2,FALSE)","v":{"$error":"#N/A"}}]
[null,null,"() ",null,"1",null,null,"No","No","No",{"$f":"VLOOKUP(B544,'DOE Codes Lookups'!$A$3:$D$507,2,FALSE)","v":{"$error":"#N/A"}}]
[null,null,"() ",null,"1",null,null,"No","No","No",{"$f":"VLOOKUP(B545,'DOE Codes Lookups'!$A$3:$D$507,2,FALSE)","v":{"$error":"#N/A"}}]
[null,null,"() ",null,"1",null,null,"No","No","No",{"$f":"VLOOKUP(B546,'DOE Codes Lookups'!$A$3:$D$507,2,FALSE)","v":{"$error":"#N/A"}}]
[null,null,"() ",null,"1",null,null,"No","No","No",{"$f":"VLOOKUP(B547,'DOE Codes Lookups'!$A$3:$D$507,2,FALSE)","v":{"$error":"#N/A"}}]
[null,null,"() ",null,"1",null,null,"No","No","No",{"$f":"VLOOKUP(B548,'DOE Codes Lookups'!$A$3:$D$507,2,FALSE)","v":{"$error":"#N/A"}}]
[null,null,"() ",null,"1",null,null,"No","No","No",{"$f":"VLOOKUP(B549,'DOE Codes Lookups'!$A$3:$D$507,2,FALSE)","v":{"$error":"#N/A"}}]
[null,null,"() ",null,"1",null,null,"No","No","No",{"$f":"VLOOKUP(B550,'DOE Codes Lookups'!$A$3:$D$507,2,FALSE)","v":{"$error":"#N/A"}}]
[null,null,"() ",null,"1",null,null,"No","No","No",{"$f":"VLOOKUP(B551,'DOE Codes Lookups'!$A$3:$D$507,2,FALSE)","v":{"$error":"#N/A"}}]
[null,null,"() ",null,"1",null,null,"No","No","No",{"$f":"VLOOKUP(B552,'DOE Codes Lookups'!$A$3:$D$507,2,FALSE)","v":{"$error":"#N/A"}}]
[null,null,"() ",null,"1",null,null,"No","No","No",{"$f":"VLOOKUP(B553,'DOE Codes Lookups'!$A$3:$D$507,2,FALSE)","v":{"$error":"#N/A"}}]
[null,null,"() ",null,"1",null,null,"No","No","No",{"$f":"VLOOKUP(B554,'DOE Codes Lookups'!$A$3:$D$507,2,FALSE)","v":{"$error":"#N/A"}}]
[null,null,"() ",null,"1",null,null,"No","No","No",{"$f":"VLOOKUP(B555,'DOE Codes Lookups'!$A$3:$D$507,2,FALSE)","v":{"$error":"#N/A"}}]
[null,null,"() ",null,"1",null,null,"No","No","No",{"$f":"VLOOKUP(B556,'DOE Codes Lookups'!$A$3:$D$507,2,FALSE)","v":{"$error":"#N/A"}}]
[null,null,"() ",null,"1",null,null,"No","No","No",{"$f":"VLOOKUP(B557,'DOE Codes Lookups'!$A$3:$D$507,2,FALSE)","v":{"$error":"#N/A"}}]
[null,null,"() ",null,"1",null,null,"No","No","No",{"$f":"VLOOKUP(B558,'DOE Codes Lookups'!$A$3:$D$507,2,FALSE)","v":{"$error":"#N/A"}}]
[null,null,"() ",null,"1",null,null,"No","No","No",{"$f":"VLOOKUP(B559,'DOE Codes Lookups'!$A$3:$D$507,2,FALSE)","v":{"$error":"#N/A"}}]
[null,null,"() ",null,"1",null,null,"No","No","No",{"$f":"VLOOKUP(B560,'DOE Codes Lookups'!$A$3:$D$507,2,FALSE)","v":{"$error":"#N/A"}}]
[null,null,"() ",null,"1",null,null,"No","No","No",{"$f":"VLOOKUP(B561,'DOE Codes Lookups'!$A$3:$D$507,2,FALSE)","v":{"$error":"#N/A"}}]
[null,null,"() ",null,"1",null,null,"No","No","No",{"$f":"VLOOKUP(B562,'DOE Codes Lookups'!$A$3:$D$507,2,FALSE)","v":{"$error":"#N/A"}}]
[null,null,"() ",null,"1",null,null,"No","No","No",{"$f":"VLOOKUP(B563,'DOE Codes Lookups'!$A$3:$D$507,2,FALSE)","v":{"$error":"#N/A"}}]
[null,null,"() ",null,"1",null,null,"No","No","No",{"$f":"VLOOKUP(B564,'DOE Codes Lookups'!$A$3:$D$507,2,FALSE)","v":{"$error":"#N/A"}}]
[null,null,"() ",null,"1",null,null,"No","No","No",{"$f":"VLOOKUP(B565,'DOE Codes Lookups'!$A$3:$D$507,2,FALSE)","v":{"$error":"#N/A"}}]
[null,null,"() ",null,"1",null,null,"No","No","No",{"$f":"VLOOKUP(B566,'DOE Codes Lookups'!$A$3:$D$507,2,FALSE)","v":{"$error":"#N/A"}}]
[null,null,"() ",null,"1",null,null,"No","No","No",{"$f":"VLOOKUP(B567,'DOE Codes Lookups'!$A$3:$D$507,2,FALSE)","v":{"$error":"#N/A"}}]
[null,null,"() ",null,"1",null,null,"No","No","No",{"$f":"VLOOKUP(B568,'DOE Codes Lookups'!$A$3:$D$507,2,FALSE)","v":{"$error":"#N/A"}}]
[null,null,"() ",null,"1",null,null,"No","No","No",{"$f":"VLOOKUP(B569,'DOE Codes Lookups'!$A$3:$D$507,2,FALSE)","v":{"$error":"#N/A"}}]
[null,null,"() ",null,"1",null,null,"No","No","No",{"$f":"VLOOKUP(B570,'DOE Codes Lookups'!$A$3:$D$507,2,FALSE)","v":{"$error":"#N/A"}}]
[null,null,"() ",null,"1",null,null,"No","No","No",{"$f":"VLOOKUP(B571,'DOE Codes Lookups'!$A$3:$D$507,2,FALSE)","v":{"$error":"#N/A"}}]
[null,null,"() ",null,"1",null,null,"No","No","No",{"$f":"VLOOKUP(B572,'DOE Codes Lookups'!$A$3:$D$507,2,FALSE)","v":{"$error":"#N/A"}}]
[null,null,"() ",null,"1",null,null,"No","No","No",{"$f":"VLOOKUP(B573,'DOE Codes Lookups'!$A$3:$D$507,2,FALSE)","v":{"$error":"#N/A"}}]
[null,null,"() ",null,"1",null,null,"No","No","No",{"$f":"VLOOKUP(B574,'DOE Codes Lookups'!$A$3:$D$507,2,FALSE)","v":{"$error":"#N/A"}}]
[null,null,"() ",null,"1",null,null,"No","No","No",{"$f":"VLOOKUP(B575,'DOE Codes Lookups'!$A$3:$D$507,2,FALSE)","v":{"$error":"#N/A"}}]
[null,null,"() ",null,"1",null,null,"No","No","No",{"$f":"VLOOKUP(B576,'DOE Codes Lookups'!$A$3:$D$507,2,FALSE)","v":{"$error":"#N/A"}}]
[null,null,"() ",null,"1",null,null,"No","No","No",{"$f":"VLOOKUP(B577,'DOE Codes Lookups'!$A$3:$D$507,2,FALSE)","v":{"$error":"#N/A"}}]
[null,null,{"$f":"CONCATENATE(\"(\",B578,\") \",D578)","v":"() "},null,{"$f":"IF(H578=\"no\",\"1\",IF(AND(H578=\"Yes\",I578=\"No\",J578=\"No\"),\"3\",IF(AND(H578=\"Yes\",I578=\"Yes\",J578=\"Yes\"),\"2\",IF(AND(H578=\"Yes\",I578=\"Yes\",J578=\"No\"),\"5\",IF(AND(H578=\"Yes\",I578=\"No\",J578=\"Yes\"),\"4\",\"0\")))))","v":"1"},null,null,{"$f":"IFERROR(VLOOKUP(B578,PSICFL_1819a,2,FALSE),\"No\")","v":"No"},{"$f":"IFERROR(VLOOKUP(B578,PSICFL_1819a,5,FALSE),\"No\")","v":"No"},{"$f":"IFERROR(VLOOKUP(B578,PSICFL_1819a,3,FALSE),\"No\")","v":"No"},{"$f":"VLOOKUP(B578,'DOE Codes Lookups'!$A$3:$D$507,2,FALSE)","v":{"$error":"#N/A"}}]
[null,null,"() ",null,"1",null,null,"No","No","No",{"$f":"VLOOKUP(B579,'DOE Codes Lookups'!$A$3:$D$507,2,FALSE)","v":{"$error":"#N/A"}}]
[null,null,"() ",null,"1",null,null,"No","No","No",{"$f":"VLOOKUP(B580,'DOE Codes Lookups'!$A$3:$D$507,2,FALSE)","v":{"$error":"#N/A"}}]
[null,null,"() ",null,"1",null,null,"No","No","No",{"$f":"VLOOKUP(B581,'DOE Codes Lookups'!$A$3:$D$507,2,FALSE)","v":{"$error":"#N/A"}}]
[null,null,"() ",null,"1",null,null,"No","No","No",{"$f":"VLOOKUP(B582,'DOE Codes Lookups'!$A$3:$D$507,2,FALSE)","v":{"$error":"#N/A"}}]
[null,null,"() ",null,"1",null,null,"No","No","No",{"$f":"VLOOKUP(B583,'DOE Codes Lookups'!$A$3:$D$507,2,FALSE)","v":{"$error":"#N/A"}}]
[null,null,"() ",null,"1",null,null,"No","No","No",{"$f":"VLOOKUP(B584,'DOE Codes Lookups'!$A$3:$D$507,2,FALSE)","v":{"$error":"#N/A"}}]
[null,null,"() ",null,"1",null,null,"No","No","No",{"$f":"VLOOKUP(B585,'DOE Codes Lookups'!$A$3:$D$507,2,FALSE)","v":{"$error":"#N/A"}}]
[null,null,"() ",null,"1",null,null,"No","No","No",{"$f":"VLOOKUP(B586,'DOE Codes Lookups'!$A$3:$D$507,2,FALSE)","v":{"$error":"#N/A"}}]
[null,null,"() ",null,"1",null,null,"No","No","No",{"$f":"VLOOKUP(B587,'DOE Codes Lookups'!$A$3:$D$507,2,FALSE)","v":{"$error":"#N/A"}}]
[null,null,"() ",null,"1",null,null,"No","No","No",{"$f":"VLOOKUP(B588,'DOE Codes Lookups'!$A$3:$D$507,2,FALSE)","v":{"$error":"#N/A"}}]
[null,null,"() ",null,"1",null,null,"No","No","No",{"$f":"VLOOKUP(B589,'DOE Codes Lookups'!$A$3:$D$507,2,FALSE)","v":{"$error":"#N/A"}}]
[null,null,"() ",null,"1",null,null,"No","No","No",{"$f":"VLOOKUP(B590,'DOE Codes Lookups'!$A$3:$D$507,2,FALSE)","v":{"$error":"#N/A"}}]
[null,null,"() ",null,"1",null,null,"No","No","No",{"$f":"VLOOKUP(B591,'DOE Codes Lookups'!$A$3:$D$507,2,FALSE)","v":{"$error":"#N/A"}}]
[null,null,"() ",null,"1",null,null,"No","No","No",{"$f":"VLOOKUP(B592,'DOE Codes Lookups'!$A$3:$D$507,2,FALSE)","v":{"$error":"#N/A"}}]
[null,null,"() ",null,"1",null,null,"No","No","No",{"$f":"VLOOKUP(B593,'DOE Codes Lookups'!$A$3:$D$507,2,FALSE)","v":{"$error":"#N/A"}}]
[null,null,"() ",null,"1",null,null,"No","No","No",{"$f":"VLOOKUP(B594,'DOE Codes Lookups'!$A$3:$D$507,2,FALSE)","v":{"$error":"#N/A"}}]
[null,null,"() ",null,"1",null,null,"No","No","No",{"$f":"VLOOKUP(B595,'DOE Codes Lookups'!$A$3:$D$507,2,FALSE)","v":{"$error":"#N/A"}}]
[null,null,"() ",null,"1",null,null,"No","No","No",{"$f":"VLOOKUP(B596,'DOE Codes Lookups'!$A$3:$D$507,2,FALSE)","v":{"$error":"#N/A"}}]
[null,null,"() ",null,"1",null,null,"No","No","No",{"$f":"VLOOKUP(B597,'DOE Codes Lookups'!$A$3:$D$507,2,FALSE)","v":{"$error":"#N/A"}}]
[null,null,"() ",null,"1",null,null,"No","No","No",{"$f":"VLOOKUP(B598,'DOE Codes Lookups'!$A$3:$D$507,2,FALSE)","v":{"$error":"#N/A"}}]
[null,null,"() ",null,"1",null,null,"No","No","No",{"$f":"VLOOKUP(B599,'DOE Codes Lookups'!$A$3:$D$507,2,FALSE)","v":{"$error":"#N/A"}}]
[null,null,"() ",null,"1",null,null,"No","No","No",{"$f":"VLOOKUP(B600,'DOE Codes Lookups'!$A$3:$D$507,2,FALSE)","v":{"$error":"#N/A"}}]
[null,null,"() ",null,"1",null,null,"No","No","No",{"$f":"VLOOKUP(B601,'DOE Codes Lookups'!$A$3:$D$507,2,FALSE)","v":{"$error":"#N/A"}}]
[null,null,"() ",null,"1",null,null,"No","No","No",{"$f":"VLOOKUP(B602,'DOE Codes Lookups'!$A$3:$D$507,2,FALSE)","v":{"$error":"#N/A"}}]
[null,null,"() ",null,"1",null,null,"No","No","No",{"$f":"VLOOKUP(B603,'DOE Codes Lookups'!$A$3:$D$507,2,FALSE)","v":{"$error":"#N/A"}}]
[null,null,"() ",null,"1",null,null,"No","No","No",{"$f":"VLOOKUP(B604,'DOE Codes Lookups'!$A$3:$D$507,2,FALSE)","v":{"$error":"#N/A"}}]
[null,null,"() ",null,"1",null,null,"No","No","No",{"$f":"VLOOKUP(B605,'DOE Codes Lookups'!$A$3:$D$507,2,FALSE)","v":{"$error":"#N/A"}}]
[null,null,"() ",null,"1",null,null,"No","No","No",{"$f":"VLOOKUP(B606,'DOE Codes Lookups'!$A$3:$D$507,2,FALSE)","v":{"$error":"#N/A"}}]
[null,null,"() ",null,"1",null,null,"No","No","No",{"$f":"VLOOKUP(B607,'DOE Codes Lookups'!$A$3:$D$507,2,FALSE)","v":{"$error":"#N/A"}}]
[null,null,"() ",null,"1",null,null,"No","No","No",{"$f":"VLOOKUP(B608,'DOE Codes Lookups'!$A$3:$D$507,2,FALSE)","v":{"$error":"#N/A"}}]
[null,null,"() ",null,"1",null,null,"No","No","No",{"$f":"VLOOKUP(B609,'DOE Codes Lookups'!$A$3:$D$507,2,FALSE)","v":{"$error":"#N/A"}}]
[null,null,"() ",null,"1",null,null,"No","No","No",{"$f":"VLOOKUP(B610,'DOE Codes Lookups'!$A$3:$D$507,2,FALSE)","v":{"$error":"#N/A"}}]
[null,null,"() ",null,"1",null,null,"No","No","No",{"$f":"VLOOKUP(B611,'DOE Codes Lookups'!$A$3:$D$507,2,FALSE)","v":{"$error":"#N/A"}}]
[null,null,"() ",null,"1",null,null,"No","No","No",{"$f":"VLOOKUP(B612,'DOE Codes Lookups'!$A$3:$D$507,2,FALSE)","v":{"$error":"#N/A"}}]
[null,null,"() ",null,"1",null,null,"No","No","No",{"$f":"VLOOKUP(B613,'DOE Codes Lookups'!$A$3:$D$507,2,FALSE)","v":{"$error":"#N/A"}}]
[null,null,"() ",null,"1",null,null,"No","No","No",{"$f":"VLOOKUP(B614,'DOE Codes Lookups'!$A$3:$D$507,2,FALSE)","v":{"$error":"#N/A"}}]
[null,null,"() ",null,"1",null,null,"No","No","No",{"$f":"VLOOKUP(B615,'DOE Codes Lookups'!$A$3:$D$507,2,FALSE)","v":{"$error":"#N/A"}}]
[null,null,"() ",null,"1",null,null,"No","No","No",{"$f":"VLOOKUP(B616,'DOE Codes Lookups'!$A$3:$D$507,2,FALSE)","v":{"$error":"#N/A"}}]
[null,null,"() ",null,"1",null,null,"No","No","No",{"$f":"VLOOKUP(B617,'DOE Codes Lookups'!$A$3:$D$507,2,FALSE)","v":{"$error":"#N/A"}}]
[null,null,"() ",null,"1",null,null,"No","No","No",{"$f":"VLOOKUP(B618,'DOE Codes Lookups'!$A$3:$D$507,2,FALSE)","v":{"$error":"#N/A"}}]
[null,null,"() ",null,"1",null,null,"No","No","No",{"$f":"VLOOKUP(B619,'DOE Codes Lookups'!$A$3:$D$507,2,FALSE)","v":{"$error":"#N/A"}}]
[null,null,"() ",null,"1",null,null,"No","No","No",{"$f":"VLOOKUP(B620,'DOE Codes Lookups'!$A$3:$D$507,2,FALSE)","v":{"$error":"#N/A"}}]
[null,null,"() ",null,"1",null,null,"No","No","No",{"$f":"VLOOKUP(B621,'DOE Codes Lookups'!$A$3:$D$507,2,FALSE)","v":{"$error":"#N/A"}}]
[null,null,"() ",null,"1",null,null,"No","No","No",{"$f":"VLOOKUP(B622,'DOE Codes Lookups'!$A$3:$D$507,2,FALSE)","v":{"$error":"#N/A"}}]
[null,null,"() ",null,"1",null,null,"No","No","No",{"$f":"VLOOKUP(B623,'DOE Codes Lookups'!$A$3:$D$507,2,FALSE)","v":{"$error":"#N/A"}}]
[null,null,"() ",null,"1",null,null,"No","No","No",{"$f":"VLOOKUP(B624,'DOE Codes Lookups'!$A$3:$D$507,2,FALSE)","v":{"$error":"#N/A"}}]
[null,null,"() ",null,"1",null,null,"No","No","No",{"$f":"VLOOKUP(B625,'DOE Codes Lookups'!$A$3:$D$507,2,FALSE)","v":{"$error":"#N/A"}}]
[null,null,"() ",null,"1",null,null,"No","No","No",{"$f":"VLOOKUP(B626,'DOE Codes Lookups'!$A$3:$D$507,2,FALSE)","v":{"$error":"#N/A"}}]
[null,null,"() ",null,"1",null,null,"No","No","No",{"$f":"VLOOKUP(B627,'DOE Codes Lookups'!$A$3:$D$507,2,FALSE)","v":{"$error":"#N/A"}}]
[null,null,"() ",null,"1",null,null,"No","No","No",{"$f":"VLOOKUP(B628,'DOE Codes Lookups'!$A$3:$D$507,2,FALSE)","v":{"$error":"#N/A"}}]
[null,null,"() ",null,"1",null,null,"No","No","No",{"$f":"VLOOKUP(B629,'DOE Codes Lookups'!$A$3:$D$507,2,FALSE)","v":{"$error":"#N/A"}}]
[null,null,"() ",null,"1",null,null,"No","No","No",{"$f":"VLOOKUP(B630,'DOE Codes Lookups'!$A$3:$D$507,2,FALSE)","v":{"$error":"#N/A"}}]
[null,null,"() ",null,"1",null,null,"No","No","No",{"$f":"VLOOKUP(B631,'DOE Codes Lookups'!$A$3:$D$507,2,FALSE)","v":{"$error":"#N/A"}}]
[null,null,"() ",null,"1",null,null,"No","No","No",{"$f":"VLOOKUP(B632,'DOE Codes Lookups'!$A$3:$D$507,2,FALSE)","v":{"$error":"#N/A"}}]
[null,null,"() ",null,"1",null,null,"No","No","No",{"$f":"VLOOKUP(B633,'DOE Codes Lookups'!$A$3:$D$507,2,FALSE)","v":{"$error":"#N/A"}}]
[null,null,"() ",null,"1",null,null,"No","No","No",{"$f":"VLOOKUP(B634,'DOE Codes Lookups'!$A$3:$D$507,2,FALSE)","v":{"$error":"#N/A"}}]
[null,null,"() ",null,"1",null,null,"No","No","No",{"$f":"VLOOKUP(B635,'DOE Codes Lookups'!$A$3:$D$507,2,FALSE)","v":{"$error":"#N/A"}}]
[null,null,"() ",null,"1",null,null,"No","No","No",{"$f":"VLOOKUP(B636,'DOE Codes Lookups'!$A$3:$D$507,2,FALSE)","v":{"$error":"#N/A"}}]
[null,null,"() ",null,"1",null,null,"No","No","No",{"$f":"VLOOKUP(B637,'DOE Codes Lookups'!$A$3:$D$507,2,FALSE)","v":{"$error":"#N/A"}}]
[null,null,"() ",null,"1",null,null,"No","No","No",{"$f":"VLOOKUP(B638,'DOE Codes Lookups'!$A$3:$D$507,2,FALSE)","v":{"$error":"#N/A"}}]
[null,null,"() ",null,"1",null,null,"No","No","No",{"$f":"VLOOKUP(B639,'DOE Codes Lookups'!$A$3:$D$507,2,FALSE)","v":{"$error":"#N/A"}}]
[null,null,"() ",null,"1",null,null,"No","No","No",{"$f":"VLOOKUP(B640,'DOE Codes Lookups'!$A$3:$D$507,2,FALSE)","v":{"$error":"#N/A"}}]
[null,null,"() ",null,"1",null,null,"No","No","No",{"$f":"VLOOKUP(B641,'DOE Codes Lookups'!$A$3:$D$507,2,FALSE)","v":{"$error":"#N/A"}}]
[null,null,{"$f":"CONCATENATE(\"(\",B642,\") \",D642)","v":"() "},null,{"$f":"IF(H642=\"no\",\"1\",IF(AND(H642=\"Yes\",I642=\"No\",J642=\"No\"),\"3\",IF(AND(H642=\"Yes\",I642=\"Yes\",J642=\"Yes\"),\"2\",IF(AND(H642=\"Yes\",I642=\"Yes\",J642=\"No\"),\"5\",IF(AND(H642=\"Yes\",I642=\"No\",J642=\"Yes\"),\"4\",\"0\")))))","v":"1"},null,null,{"$f":"IFERROR(VLOOKUP(B642,PSICFL_1819a,2,FALSE),\"No\")","v":"No"},{"$f":"IFERROR(VLOOKUP(B642,PSICFL_1819a,5,FALSE),\"No\")","v":"No"},{"$f":"IFERROR(VLOOKUP(B642,PSICFL_1819a,3,FALSE),\"No\")","v":"No"},{"$f":"VLOOKUP(B642,'DOE Codes Lookups'!$A$3:$D$507,2,FALSE)","v":{"$error":"#N/A"}}]
[null,null,"() ",null,"1",null,null,"No","No","No",{"$f":"VLOOKUP(B643,'DOE Codes Lookups'!$A$3:$D$507,2,FALSE)","v":{"$error":"#N/A"}}]
[null,null,"() ",null,"1",null,null,"No","No","No",{"$f":"VLOOKUP(B644,'DOE Codes Lookups'!$A$3:$D$507,2,FALSE)","v":{"$error":"#N/A"}}]
[null,null,"() ",null,"1",null,null,"No","No","No",{"$f":"VLOOKUP(B645,'DOE Codes Lookups'!$A$3:$D$507,2,FALSE)","v":{"$error":"#N/A"}}]
[null,null,"() ",null,"1",null,null,"No","No","No",{"$f":"VLOOKUP(B646,'DOE Codes Lookups'!$A$3:$D$507,2,FALSE)","v":{"$error":"#N/A"}}]
[null,null,"() ",null,"1",null,null,"No","No","No",{"$f":"VLOOKUP(B647,'DOE Codes Lookups'!$A$3:$D$507,2,FALSE)","v":{"$error":"#N/A"}}]
[null,null,"() ",null,"1",null,null,"No","No","No",{"$f":"VLOOKUP(B648,'DOE Codes Lookups'!$A$3:$D$507,2,FALSE)","v":{"$error":"#N/A"}}]
[null,null,"() ",null,"1",null,null,"No","No","No",{"$f":"VLOOKUP(B649,'DOE Codes Lookups'!$A$3:$D$507,2,FALSE)","v":{"$error":"#N/A"}}]
[null,null,"() ",null,"1",null,null,"No","No","No",{"$f":"VLOOKUP(B650,'DOE Codes Lookups'!$A$3:$D$507,2,FALSE)","v":{"$error":"#N/A"}}]
[null,null,"() ",null,"1",null,null,"No","No","No",{"$f":"VLOOKUP(B651,'DOE Codes Lookups'!$A$3:$D$507,2,FALSE)","v":{"$error":"#N/A"}}]
[null,null,"() ",null,"1",null,null,"No","No","No",{"$f":"VLOOKUP(B652,'DOE Codes Lookups'!$A$3:$D$507,2,FALSE)","v":{"$error":"#N/A"}}]
[null,null,"() ",null,"1",null,null,"No","No","No",{"$f":"VLOOKUP(B653,'DOE Codes Lookups'!$A$3:$D$507,2,FALSE)","v":{"$error":"#N/A"}}]
[null,null,"() ",null,"1",null,null,"No","No","No",{"$f":"VLOOKUP(B654,'DOE Codes Lookups'!$A$3:$D$507,2,FALSE)","v":{"$error":"#N/A"}}]
[null,null,"() ",null,"1",null,null,"No","No","No",{"$f":"VLOOKUP(B655,'DOE Codes Lookups'!$A$3:$D$507,2,FALSE)","v":{"$error":"#N/A"}}]
[null,null,"() ",null,"1",null,null,"No","No","No",{"$f":"VLOOKUP(B656,'DOE Codes Lookups'!$A$3:$D$507,2,FALSE)","v":{"$error":"#N/A"}}]
[null,null,"() ",null,"1",null,null,"No","No","No",{"$f":"VLOOKUP(B657,'DOE Codes Lookups'!$A$3:$D$507,2,FALSE)","v":{"$error":"#N/A"}}]
[null,null,"() ",null,"1",null,null,"No","No","No",{"$f":"VLOOKUP(B658,'DOE Codes Lookups'!$A$3:$D$507,2,FALSE)","v":{"$error":"#N/A"}}]
[null,null,"() ",null,"1",null,null,"No","No","No",{"$f":"VLOOKUP(B659,'DOE Codes Lookups'!$A$3:$D$507,2,FALSE)","v":{"$error":"#N/A"}}]
[null,null,"() ",null,"1",null,null,"No","No","No",{"$f":"VLOOKUP(B660,'DOE Codes Lookups'!$A$3:$D$507,2,FALSE)","v":{"$error":"#N/A"}}]
[null,null,"() ",null,"1",null,null,"No","No","No",{"$f":"VLOOKUP(B661,'DOE Codes Lookups'!$A$3:$D$507,2,FALSE)","v":{"$error":"#N/A"}}]
[null,null,"() ",null,"1",null,null,"No","No","No",{"$f":"VLOOKUP(B662,'DOE Codes Lookups'!$A$3:$D$507,2,FALSE)","v":{"$error":"#N/A"}}]
[null,null,"() ",null,"1",null,null,"No","No","No",{"$f":"VLOOKUP(B663,'DOE Codes Lookups'!$A$3:$D$507,2,FALSE)","v":{"$error":"#N/A"}}]
[null,null,"() ",null,"1",null,null,"No","No","No",{"$f":"VLOOKUP(B664,'DOE Codes Lookups'!$A$3:$D$507,2,FALSE)","v":{"$error":"#N/A"}}]
[null,null,"() ",null,"1",null,null,"No","No","No",{"$f":"VLOOKUP(B665,'DOE Codes Lookups'!$A$3:$D$507,2,FALSE)","v":{"$error":"#N/A"}}]
[null,null,"() ",null,"1",null,null,"No","No","No",{"$f":"VLOOKUP(B666,'DOE Codes Lookups'!$A$3:$D$507,2,FALSE)","v":{"$error":"#N/A"}}]
[null,null,"() ",null,"1",null,null,"No","No","No",{"$f":"VLOOKUP(B667,'DOE Codes Lookups'!$A$3:$D$507,2,FALSE)","v":{"$error":"#N/A"}}]
[null,null,"() ",null,"1",null,null,"No","No","No",{"$f":"VLOOKUP(B668,'DOE Codes Lookups'!$A$3:$D$507,2,FALSE)","v":{"$error":"#N/A"}}]
[null,null,"() ",null,"1",null,null,"No","No","No",{"$f":"VLOOKUP(B669,'DOE Codes Lookups'!$A$3:$D$507,2,FALSE)","v":{"$error":"#N/A"}}]
[null,null,"() ",null,"1",null,null,"No","No","No",{"$f":"VLOOKUP(B670,'DOE Codes Lookups'!$A$3:$D$507,2,FALSE)","v":{"$error":"#N/A"}}]
[null,null,"() ",null,"1",null,null,"No","No","No",{"$f":"VLOOKUP(B671,'DOE Codes Lookups'!$A$3:$D$507,2,FALSE)","v":{"$error":"#N/A"}}]
[null,null,"() ",null,"1",null,null,"No","No","No",{"$f":"VLOOKUP(B672,'DOE Codes Lookups'!$A$3:$D$507,2,FALSE)","v":{"$error":"#N/A"}}]
[null,null,"() ",null,"1",null,null,"No","No","No",{"$f":"VLOOKUP(B673,'DOE Codes Lookups'!$A$3:$D$507,2,FALSE)","v":{"$error":"#N/A"}}]
[null,null,"() ",null,"1",null,null,"No","No","No",{"$f":"VLOOKUP(B674,'DOE Codes Lookups'!$A$3:$D$507,2,FALSE)","v":{"$error":"#N/A"}}]
[null,null,"() ",null,"1",null,null,"No","No","No",{"$f":"VLOOKUP(B675,'DOE Codes Lookups'!$A$3:$D$507,2,FALSE)","v":{"$error":"#N/A"}}]
[null,null,"() ",null,"1",null,null,"No","No","No",{"$f":"VLOOKUP(B676,'DOE Codes Lookups'!$A$3:$D$507,2,FALSE)","v":{"$error":"#N/A"}}]
[null,null,"() ",null,"1",null,null,"No","No","No",{"$f":"VLOOKUP(B677,'DOE Codes Lookups'!$A$3:$D$507,2,FALSE)","v":{"$error":"#N/A"}}]
[null,null,"() ",null,"1",null,null,"No","No","No",{"$f":"VLOOKUP(B678,'DOE Codes Lookups'!$A$3:$D$507,2,FALSE)","v":{"$error":"#N/A"}}]
[null,null,"() ",null,"1",null,null,"No","No","No",{"$f":"VLOOKUP(B679,'DOE Codes Lookups'!$A$3:$D$507,2,FALSE)","v":{"$error":"#N/A"}}]
[null,null,"() ",null,"1",null,null,"No","No","No",{"$f":"VLOOKUP(B680,'DOE Codes Lookups'!$A$3:$D$507,2,FALSE)","v":{"$error":"#N/A"}}]
[null,null,"() ",null,"1",null,null,"No","No","No",{"$f":"VLOOKUP(B681,'DOE Codes Lookups'!$A$3:$D$507,2,FALSE)","v":{"$error":"#N/A"}}]
[null,null,"() ",null,"1",null,null,"No","No","No",{"$f":"VLOOKUP(B682,'DOE Codes Lookups'!$A$3:$D$507,2,FALSE)","v":{"$error":"#N/A"}}]
[null,null,"() ",null,"1",null,null,"No","No","No",{"$f":"VLOOKUP(B683,'DOE Codes Lookups'!$A$3:$D$507,2,FALSE)","v":{"$error":"#N/A"}}]
[null,null,"() ",null,"1",null,null,"No","No","No",{"$f":"VLOOKUP(B684,'DOE Codes Lookups'!$A$3:$D$507,2,FALSE)","v":{"$error":"#N/A"}}]
[null,null,"() ",null,"1",null,null,"No","No","No",{"$f":"VLOOKUP(B685,'DOE Codes Lookups'!$A$3:$D$507,2,FALSE)","v":{"$error":"#N/A"}}]
[null,null,"() ",null,"1",null,null,"No","No","No",{"$f":"VLOOKUP(B686,'DOE Codes Lookups'!$A$3:$D$507,2,FALSE)","v":{"$error":"#N/A"}}]
[null,null,"() ",null,"1",null,null,"No","No","No",{"$f":"VLOOKUP(B687,'DOE Codes Lookups'!$A$3:$D$507,2,FALSE)","v":{"$error":"#N/A"}}]
[null,null,"() ",null,"1",null,null,"No","No","No",{"$f":"VLOOKUP(B688,'DOE Codes Lookups'!$A$3:$D$507,2,FALSE)","v":{"$error":"#N/A"}}]
[null,null,"() ",null,"1",null,null,"No","No","No",{"$f":"VLOOKUP(B689,'DOE Codes Lookups'!$A$3:$D$507,2,FALSE)","v":{"$error":"#N/A"}}]
[null,null,"() ",null,"1",null,null,"No","No","No",{"$f":"VLOOKUP(B690,'DOE Codes Lookups'!$A$3:$D$507,2,FALSE)","v":{"$error":"#N/A"}}]
[null,null,"() ",null,"1",null,null,"No","No","No",{"$f":"VLOOKUP(B691,'DOE Codes Lookups'!$A$3:$D$507,2,FALSE)","v":{"$error":"#N/A"}}]
[null,null,"() ",null,"1",null,null,"No","No","No",{"$f":"VLOOKUP(B692,'DOE Codes Lookups'!$A$3:$D$507,2,FALSE)","v":{"$error":"#N/A"}}]
[null,null,"() ",null,"1",null,null,"No","No","No",{"$f":"VLOOKUP(B693,'DOE Codes Lookups'!$A$3:$D$507,2,FALSE)","v":{"$error":"#N/A"}}]
[null,null,"() ",null,"1",null,null,"No","No","No",{"$f":"VLOOKUP(B694,'DOE Codes Lookups'!$A$3:$D$507,2,FALSE)","v":{"$error":"#N/A"}}]
[null,null,"() ",null,"1",null,null,"No","No","No",{"$f":"VLOOKUP(B695,'DOE Codes Lookups'!$A$3:$D$507,2,FALSE)","v":{"$error":"#N/A"}}]
[null,null,"() ",null,"1",null,null,"No","No","No",{"$f":"VLOOKUP(B696,'DOE Codes Lookups'!$A$3:$D$507,2,FALSE)","v":{"$error":"#N/A"}}]
[null,null,"() ",null,"1",null,null,"No","No","No",{"$f":"VLOOKUP(B697,'DOE Codes Lookups'!$A$3:$D$507,2,FALSE)","v":{"$error":"#N/A"}}]
[null,null,"() ",null,"1",null,null,"No","No","No",{"$f":"VLOOKUP(B698,'DOE Codes Lookups'!$A$3:$D$507,2,FALSE)","v":{"$error":"#N/A"}}]
[null,null,"() ",null,"1",null,null,"No","No","No",{"$f":"VLOOKUP(B699,'DOE Codes Lookups'!$A$3:$D$507,2,FALSE)","v":{"$error":"#N/A"}}]
[null,null,"() ",null,"1",null,null,"No","No","No",{"$f":"VLOOKUP(B700,'DOE Codes Lookups'!$A$3:$D$507,2,FALSE)","v":{"$error":"#N/A"}}]
[null,null,"() ",null,"1",null,null,"No","No","No",{"$f":"VLOOKUP(B701,'DOE Codes Lookups'!$A$3:$D$507,2,FALSE)","v":{"$error":"#N/A"}}]
[null,null,"() ",null,"1",null,null,"No","No","No",{"$f":"VLOOKUP(B702,'DOE Codes Lookups'!$A$3:$D$507,2,FALSE)","v":{"$error":"#N/A"}}]
[null,null,"() ",null,"1",null,null,"No","No","No",{"$f":"VLOOKUP(B703,'DOE Codes Lookups'!$A$3:$D$507,2,FALSE)","v":{"$error":"#N/A"}}]
[null,null,"() ",null,"1",null,null,"No","No","No",{"$f":"VLOOKUP(B704,'DOE Codes Lookups'!$A$3:$D$507,2,FALSE)","v":{"$error":"#N/A"}}]
[null,null,"() ",null,"1",null,null,"No","No","No",{"$f":"VLOOKUP(B705,'DOE Codes Lookups'!$A$3:$D$507,2,FALSE)","v":{"$error":"#N/A"}}]
[null,null,{"$f":"CONCATENATE(\"(\",B706,\") \",D706)","v":"() "},null,{"$f":"IF(H706=\"no\",\"1\",IF(AND(H706=\"Yes\",I706=\"No\",J706=\"No\"),\"3\",IF(AND(H706=\"Yes\",I706=\"Yes\",J706=\"Yes\"),\"2\",IF(AND(H706=\"Yes\",I706=\"Yes\",J706=\"No\"),\"5\",IF(AND(H706=\"Yes\",I706=\"No\",J706=\"Yes\"),\"4\",\"0\")))))","v":"1"},null,null,{"$f":"IFERROR(VLOOKUP(B706,PSICFL_1819a,2,FALSE),\"No\")","v":"No"},{"$f":"IFERROR(VLOOKUP(B706,PSICFL_1819a,5,FALSE),\"No\")","v":"No"},{"$f":"IFERROR(VLOOKUP(B706,PSICFL_1819a,3,FALSE),\"No\")","v":"No"},{"$f":"VLOOKUP(B706,'DOE Codes Lookups'!$A$3:$D$507,2,FALSE)","v":{"$error":"#N/A"}}]
[null,null,"() ",null,"1",null,null,"No","No","No",{"$f":"VLOOKUP(B707,'DOE Codes Lookups'!$A$3:$D$507,2,FALSE)","v":{"$error":"#N/A"}}]
[null,null,"() ",null,"1",null,null,"No","No","No",{"$f":"VLOOKUP(B708,'DOE Codes Lookups'!$A$3:$D$507,2,FALSE)","v":{"$error":"#N/A"}}]
[null,null,"() ",null,"1",null,null,"No","No","No",{"$f":"VLOOKUP(B709,'DOE Codes Lookups'!$A$3:$D$507,2,FALSE)","v":{"$error":"#N/A"}}]
[null,null,"() ",null,"1",null,null,"No","No","No",{"$f":"VLOOKUP(B710,'DOE Codes Lookups'!$A$3:$D$507,2,FALSE)","v":{"$error":"#N/A"}}]
[null,null,"() ",null,"1",null,null,"No","No","No",{"$f":"VLOOKUP(B711,'DOE Codes Lookups'!$A$3:$D$507,2,FALSE)","v":{"$error":"#N/A"}}]
[null,null,"() ",null,"1",null,null,"No","No","No",{"$f":"VLOOKUP(B712,'DOE Codes Lookups'!$A$3:$D$507,2,FALSE)","v":{"$error":"#N/A"}}]
[null,null,"() ",null,"1",null,null,"No","No","No",{"$f":"VLOOKUP(B713,'DOE Codes Lookups'!$A$3:$D$507,2,FALSE)","v":{"$error":"#N/A"}}]
[null,null,"() ",null,"1",null,null,"No","No","No",{"$f":"VLOOKUP(B714,'DOE Codes Lookups'!$A$3:$D$507,2,FALSE)","v":{"$error":"#N/A"}}]
[null,null,"() ",null,"1",null,null,"No","No","No",{"$f":"VLOOKUP(B715,'DOE Codes Lookups'!$A$3:$D$507,2,FALSE)","v":{"$error":"#N/A"}}]
[null,null,"() ",null,"1",null,null,"No","No","No",{"$f":"VLOOKUP(B716,'DOE Codes Lookups'!$A$3:$D$507,2,FALSE)","v":{"$error":"#N/A"}}]
[null,null,"() ",null,"1",null,null,"No","No","No",{"$f":"VLOOKUP(B717,'DOE Codes Lookups'!$A$3:$D$507,2,FALSE)","v":{"$error":"#N/A"}}]
[null,null,"() ",null,"1",null,null,"No","No","No",{"$f":"VLOOKUP(B718,'DOE Codes Lookups'!$A$3:$D$507,2,FALSE)","v":{"$error":"#N/A"}}]
[null,null,"() ",null,"1",null,null,"No","No","No",{"$f":"VLOOKUP(B719,'DOE Codes Lookups'!$A$3:$D$507,2,FALSE)","v":{"$error":"#N/A"}}]
[null,null,"() ",null,"1",null,null,"No","No","No",{"$f":"VLOOKUP(B720,'DOE Codes Lookups'!$A$3:$D$507,2,FALSE)","v":{"$error":"#N/A"}}]
[null,null,"() ",null,"1",null,null,"No","No","No",{"$f":"VLOOKUP(B721,'DOE Codes Lookups'!$A$3:$D$507,2,FALSE)","v":{"$error":"#N/A"}}]
[null,null,"() ",null,"1",null,null,"No","No","No",{"$f":"VLOOKUP(B722,'DOE Codes Lookups'!$A$3:$D$507,2,FALSE)","v":{"$error":"#N/A"}}]
[null,null,"() ",null,"1",null,null,"No","No","No",{"$f":"VLOOKUP(B723,'DOE Codes Lookups'!$A$3:$D$507,2,FALSE)","v":{"$error":"#N/A"}}]
[null,null,"() ",null,"1",null,null,"No","No","No",{"$f":"VLOOKUP(B724,'DOE Codes Lookups'!$A$3:$D$507,2,FALSE)","v":{"$error":"#N/A"}}]
[null,null,"() ",null,"1",null,null,"No","No","No",{"$f":"VLOOKUP(B725,'DOE Codes Lookups'!$A$3:$D$507,2,FALSE)","v":{"$error":"#N/A"}}]
[null,null,"() ",null,"1",null,null,"No","No","No",{"$f":"VLOOKUP(B726,'DOE Codes Lookups'!$A$3:$D$507,2,FALSE)","v":{"$error":"#N/A"}}]
[null,null,"() ",null,"1",null,null,"No","No","No",{"$f":"VLOOKUP(B727,'DOE Codes Lookups'!$A$3:$D$507,2,FALSE)","v":{"$error":"#N/A"}}]
[null,null,"() ",null,"1",null,null,"No","No","No",{"$f":"VLOOKUP(B728,'DOE Codes Lookups'!$A$3:$D$507,2,FALSE)","v":{"$error":"#N/A"}}]
[null,null,"() ",null,"1",null,null,"No","No","No",{"$f":"VLOOKUP(B729,'DOE Codes Lookups'!$A$3:$D$507,2,FALSE)","v":{"$error":"#N/A"}}]
[null,null,"() ",null,"1",null,null,"No","No","No",{"$f":"VLOOKUP(B730,'DOE Codes Lookups'!$A$3:$D$507,2,FALSE)","v":{"$error":"#N/A"}}]
[null,null,"() ",null,"1",null,null,"No","No","No",{"$f":"VLOOKUP(B731,'DOE Codes Lookups'!$A$3:$D$507,2,FALSE)","v":{"$error":"#N/A"}}]
[null,null,"() ",null,"1",null,null,"No","No","No",{"$f":"VLOOKUP(B732,'DOE Codes Lookups'!$A$3:$D$507,2,FALSE)","v":{"$error":"#N/A"}}]
[null,null,"() ",null,"1",null,null,"No","No","No",{"$f":"VLOOKUP(B733,'DOE Codes Lookups'!$A$3:$D$507,2,FALSE)","v":{"$error":"#N/A"}}]
[null,null,"() ",null,"1",null,null,"No","No","No",{"$f":"VLOOKUP(B734,'DOE Codes Lookups'!$A$3:$D$507,2,FALSE)","v":{"$error":"#N/A"}}]
[null,null,"() ",null,"1",null,null,"No","No","No",{"$f":"VLOOKUP(B735,'DOE Codes Lookups'!$A$3:$D$507,2,FALSE)","v":{"$error":"#N/A"}}]
[null,null,"() ",null,"1",null,null,"No","No","No",{"$f":"VLOOKUP(B736,'DOE Codes Lookups'!$A$3:$D$507,2,FALSE)","v":{"$error":"#N/A"}}]
[null,null,"() ",null,"1",null,null,"No","No","No",{"$f":"VLOOKUP(B737,'DOE Codes Lookups'!$A$3:$D$507,2,FALSE)","v":{"$error":"#N/A"}}]
[null,null,"() ",null,"1",null,null,"No","No","No",{"$f":"VLOOKUP(B738,'DOE Codes Lookups'!$A$3:$D$507,2,FALSE)","v":{"$error":"#N/A"}}]
[null,null,"() ",null,"1",null,null,"No","No","No",{"$f":"VLOOKUP(B739,'DOE Codes Lookups'!$A$3:$D$507,2,FALSE)","v":{"$error":"#N/A"}}]
[null,null,"() ",null,"1",null,null,"No","No","No",{"$f":"VLOOKUP(B740,'DOE Codes Lookups'!$A$3:$D$507,2,FALSE)","v":{"$error":"#N/A"}}]
[null,null,"() ",null,"1",null,null,"No","No","No",{"$f":"VLOOKUP(B741,'DOE Codes Lookups'!$A$3:$D$507,2,FALSE)","v":{"$error":"#N/A"}}]
[null,null,"() ",null,"1",null,null,"No","No","No",{"$f":"VLOOKUP(B742,'DOE Codes Lookups'!$A$3:$D$507,2,FALSE)","v":{"$error":"#N/A"}}]
[null,null,"() ",null,"1",null,null,"No","No","No",{"$f":"VLOOKUP(B743,'DOE Codes Lookups'!$A$3:$D$507,2,FALSE)","v":{"$error":"#N/A"}}]
[null,null,"() ",null,"1",null,null,"No","No","No",{"$f":"VLOOKUP(B744,'DOE Codes Lookups'!$A$3:$D$507,2,FALSE)","v":{"$error":"#N/A"}}]
[null,null,"() ",null,"1",null,null,"No","No","No",{"$f":"VLOOKUP(B745,'DOE Codes Lookups'!$A$3:$D$507,2,FALSE)","v":{"$error":"#N/A"}}]
[null,null,"() ",null,"1",null,null,"No","No","No",{"$f":"VLOOKUP(B746,'DOE Codes Lookups'!$A$3:$D$507,2,FALSE)","v":{"$error":"#N/A"}}]
[null,null,"() ",null,"1",null,null,"No","No","No",{"$f":"VLOOKUP(B747,'DOE Codes Lookups'!$A$3:$D$507,2,FALSE)","v":{"$error":"#N/A"}}]
[null,null,"() ",null,"1",null,null,"No","No","No",{"$f":"VLOOKUP(B748,'DOE Codes Lookups'!$A$3:$D$507,2,FALSE)","v":{"$error":"#N/A"}}]
[null,null,"() ",null,"1",null,null,"No","No","No",{"$f":"VLOOKUP(B749,'DOE Codes Lookups'!$A$3:$D$507,2,FALSE)","v":{"$error":"#N/A"}}]
[null,null,"() ",null,"1",null,null,"No","No","No",{"$f":"VLOOKUP(B750,'DOE Codes Lookups'!$A$3:$D$507,2,FALSE)","v":{"$error":"#N/A"}}]
[null,null,"() ",null,"1",null,null,"No","No","No",{"$f":"VLOOKUP(B751,'DOE Codes Lookups'!$A$3:$D$507,2,FALSE)","v":{"$error":"#N/A"}}]
[null,null,"() ",null,"1",null,null,"No","No","No",{"$f":"VLOOKUP(B752,'DOE Codes Lookups'!$A$3:$D$507,2,FALSE)","v":{"$error":"#N/A"}}]
[null,null,"() ",null,"1",null,null,"No","No","No",{"$f":"VLOOKUP(B753,'DOE Codes Lookups'!$A$3:$D$507,2,FALSE)","v":{"$error":"#N/A"}}]
[null,null,"() ",null,"1",null,null,"No","No","No",{"$f":"VLOOKUP(B754,'DOE Codes Lookups'!$A$3:$D$507,2,FALSE)","v":{"$error":"#N/A"}}]
[null,null,"() ",null,"1",null,null,"No","No","No",{"$f":"VLOOKUP(B755,'DOE Codes Lookups'!$A$3:$D$507,2,FALSE)","v":{"$error":"#N/A"}}]
[null,null,"() ",null,"1",null,null,"No","No","No",{"$f":"VLOOKUP(B756,'DOE Codes Lookups'!$A$3:$D$507,2,FALSE)","v":{"$error":"#N/A"}}]
[null,null,"() ",null,"1",null,null,"No","No","No",{"$f":"VLOOKUP(B757,'DOE Codes Lookups'!$A$3:$D$507,2,FALSE)","v":{"$error":"#N/A"}}]
[null,null,"() ",null,"1",null,null,"No","No","No",{"$f":"VLOOKUP(B758,'DOE Codes Lookups'!$A$3:$D$507,2,FALSE)","v":{"$error":"#N/A"}}]
[null,null,"() ",null,"1",null,null,"No","No","No",{"$f":"VLOOKUP(B759,'DOE Codes Lookups'!$A$3:$D$507,2,FALSE)","v":{"$error":"#N/A"}}]
[null,null,"() ",null,"1",null,null,"No","No","No",{"$f":"VLOOKUP(B760,'DOE Codes Lookups'!$A$3:$D$507,2,FALSE)","v":{"$error":"#N/A"}}]
[null,null,"() ",null,"1",null,null,"No","No","No",{"$f":"VLOOKUP(B761,'DOE Codes Lookups'!$A$3:$D$507,2,FALSE)","v":{"$error":"#N/A"}}]
[null,null,"() ",null,"1",null,null,"No","No","No",{"$f":"VLOOKUP(B762,'DOE Codes Lookups'!$A$3:$D$507,2,FALSE)","v":{"$error":"#N/A"}}]
[null,null,"() ",null,"1",null,null,"No","No","No",{"$f":"VLOOKUP(B763,'DOE Codes Lookups'!$A$3:$D$507,2,FALSE)","v":{"$error":"#N/A"}}]
[null,null,"() ",null,"1",null,null,"No","No","No",{"$f":"VLOOKUP(B764,'DOE Codes Lookups'!$A$3:$D$507,2,FALSE)","v":{"$error":"#N/A"}}]
[null,null,"() ",null,"1",null,null,"No","No","No",{"$f":"VLOOKUP(B765,'DOE Codes Lookups'!$A$3:$D$507,2,FALSE)","v":{"$error":"#N/A"}}]
[null,null,"() ",null,"1",null,null,"No","No","No",{"$f":"VLOOKUP(B766,'DOE Codes Lookups'!$A$3:$D$507,2,FALSE)","v":{"$error":"#N/A"}}]
[null,null,"() ",null,"1",null,null,"No","No","No",{"$f":"VLOOKUP(B767,'DOE Codes Lookups'!$A$3:$D$507,2,FALSE)","v":{"$error":"#N/A"}}]
[null,null,"() ",null,"1",null,null,"No","No","No",{"$f":"VLOOKUP(B768,'DOE Codes Lookups'!$A$3:$D$507,2,FALSE)","v":{"$error":"#N/A"}}]
[null,null,"() ",null,"1",null,null,"No","No","No",{"$f":"VLOOKUP(B769,'DOE Codes Lookups'!$A$3:$D$507,2,FALSE)","v":{"$error":"#N/A"}}]
[null,null,{"$f":"CONCATENATE(\"(\",B770,\") \",D770)","v":"() "},null,{"$f":"IF(H770=\"no\",\"1\",IF(AND(H770=\"Yes\",I770=\"No\",J770=\"No\"),\"3\",IF(AND(H770=\"Yes\",I770=\"Yes\",J770=\"Yes\"),\"2\",IF(AND(H770=\"Yes\",I770=\"Yes\",J770=\"No\"),\"5\",IF(AND(H770=\"Yes\",I770=\"No\",J770=\"Yes\"),\"4\",\"0\")))))","v":"1"},null,null,{"$f":"IFERROR(VLOOKUP(B770,PSICFL_1819a,2,FALSE),\"No\")","v":"No"},{"$f":"IFERROR(VLOOKUP(B770,PSICFL_1819a,5,FALSE),\"No\")","v":"No"},{"$f":"IFERROR(VLOOKUP(B770,PSICFL_1819a,3,FALSE),\"No\")","v":"No"},{"$f":"VLOOKUP(B770,'DOE Codes Lookups'!$A$3:$D$507,2,FALSE)","v":{"$error":"#N/A"}}]
[null,null,"() ",null,"1",null,null,"No","No","No",{"$f":"VLOOKUP(B771,'DOE Codes Lookups'!$A$3:$D$507,2,FALSE)","v":{"$error":"#N/A"}}]
[null,null,"() ",null,"1",null,null,"No","No","No",{"$f":"VLOOKUP(B772,'DOE Codes Lookups'!$A$3:$D$507,2,FALSE)","v":{"$error":"#N/A"}}]
[null,null,"() ",null,"1",null,null,"No","No","No",{"$f":"VLOOKUP(B773,'DOE Codes Lookups'!$A$3:$D$507,2,FALSE)","v":{"$error":"#N/A"}}]
[null,null,"() ",null,"1",null,null,"No","No","No",{"$f":"VLOOKUP(B774,'DOE Codes Lookups'!$A$3:$D$507,2,FALSE)","v":{"$error":"#N/A"}}]
[null,null,"() ",null,"1",null,null,"No","No","No",{"$f":"VLOOKUP(B775,'DOE Codes Lookups'!$A$3:$D$507,2,FALSE)","v":{"$error":"#N/A"}}]
[null,null,"() ",null,"1",null,null,"No","No","No",{"$f":"VLOOKUP(B776,'DOE Codes Lookups'!$A$3:$D$507,2,FALSE)","v":{"$error":"#N/A"}}]
[null,null,"() ",null,"1",null,null,"No","No","No",{"$f":"VLOOKUP(B777,'DOE Codes Lookups'!$A$3:$D$507,2,FALSE)","v":{"$error":"#N/A"}}]
[null,null,"() ",null,"1",null,null,"No","No","No",{"$f":"VLOOKUP(B778,'DOE Codes Lookups'!$A$3:$D$507,2,FALSE)","v":{"$error":"#N/A"}}]
[null,null,"() ",null,"1",null,null,"No","No","No",{"$f":"VLOOKUP(B779,'DOE Codes Lookups'!$A$3:$D$507,2,FALSE)","v":{"$error":"#N/A"}}]
[null,null,"() ",null,"1",null,null,"No","No","No",{"$f":"VLOOKUP(B780,'DOE Codes Lookups'!$A$3:$D$507,2,FALSE)","v":{"$error":"#N/A"}}]
[null,null,"() ",null,"1",null,null,"No","No","No",{"$f":"VLOOKUP(B781,'DOE Codes Lookups'!$A$3:$D$507,2,FALSE)","v":{"$error":"#N/A"}}]
[null,null,"() ",null,"1",null,null,"No","No","No",{"$f":"VLOOKUP(B782,'DOE Codes Lookups'!$A$3:$D$507,2,FALSE)","v":{"$error":"#N/A"}}]
[null,null,"() ",null,"1",null,null,"No","No","No",{"$f":"VLOOKUP(B783,'DOE Codes Lookups'!$A$3:$D$507,2,FALSE)","v":{"$error":"#N/A"}}]
[null,null,"() ",null,"1",null,null,"No","No","No",{"$f":"VLOOKUP(B784,'DOE Codes Lookups'!$A$3:$D$507,2,FALSE)","v":{"$error":"#N/A"}}]
[null,null,"() ",null,"1",null,null,"No","No","No",{"$f":"VLOOKUP(B785,'DOE Codes Lookups'!$A$3:$D$507,2,FALSE)","v":{"$error":"#N/A"}}]
[null,null,"() ",null,"1",null,null,"No","No","No",{"$f":"VLOOKUP(B786,'DOE Codes Lookups'!$A$3:$D$507,2,FALSE)","v":{"$error":"#N/A"}}]
[null,null,"() ",null,"1",null,null,"No","No","No",{"$f":"VLOOKUP(B787,'DOE Codes Lookups'!$A$3:$D$507,2,FALSE)","v":{"$error":"#N/A"}}]
[null,null,"() ",null,"1",null,null,"No","No","No",{"$f":"VLOOKUP(B788,'DOE Codes Lookups'!$A$3:$D$507,2,FALSE)","v":{"$error":"#N/A"}}]
[null,null,"() ",null,"1",null,null,"No","No","No",{"$f":"VLOOKUP(B789,'DOE Codes Lookups'!$A$3:$D$507,2,FALSE)","v":{"$error":"#N/A"}}]
[null,null,"() ",null,"1",null,null,"No","No","No",{"$f":"VLOOKUP(B790,'DOE Codes Lookups'!$A$3:$D$507,2,FALSE)","v":{"$error":"#N/A"}}]
[null,null,"() ",null,"1",null,null,"No","No","No",{"$f":"VLOOKUP(B791,'DOE Codes Lookups'!$A$3:$D$507,2,FALSE)","v":{"$error":"#N/A"}}]
[null,null,"() ",null,"1",null,null,"No","No","No",{"$f":"VLOOKUP(B792,'DOE Codes Lookups'!$A$3:$D$507,2,FALSE)","v":{"$error":"#N/A"}}]
[null,null,"() ",null,"1",null,null,"No","No","No",{"$f":"VLOOKUP(B793,'DOE Codes Lookups'!$A$3:$D$507,2,FALSE)","v":{"$error":"#N/A"}}]
[null,null,"() ",null,"1",null,null,"No","No","No",{"$f":"VLOOKUP(B794,'DOE Codes Lookups'!$A$3:$D$507,2,FALSE)","v":{"$error":"#N/A"}}]
[null,null,"() ",null,"1",null,null,"No","No","No",{"$f":"VLOOKUP(B795,'DOE Codes Lookups'!$A$3:$D$507,2,FALSE)","v":{"$error":"#N/A"}}]
[null,null,"() ",null,"1",null,null,"No","No","No",{"$f":"VLOOKUP(B796,'DOE Codes Lookups'!$A$3:$D$507,2,FALSE)","v":{"$error":"#N/A"}}]
[null,null,"() ",null,"1",null,null,"No","No","No",{"$f":"VLOOKUP(B797,'DOE Codes Lookups'!$A$3:$D$507,2,FALSE)","v":{"$error":"#N/A"}}]
[null,null,"() ",null,"1",null,null,"No","No","No",{"$f":"VLOOKUP(B798,'DOE Codes Lookups'!$A$3:$D$507,2,FALSE)","v":{"$error":"#N/A"}}]
[null,null,"() ",null,"1",null,null,"No","No","No",{"$f":"VLOOKUP(B799,'DOE Codes Lookups'!$A$3:$D$507,2,FALSE)","v":{"$error":"#N/A"}}]
[null,null,"() ",null,"1",null,null,"No","No","No",{"$f":"VLOOKUP(B800,'DOE Codes Lookups'!$A$3:$D$507,2,FALSE)","v":{"$error":"#N/A"}}]
[null,null,"() ",null,"1",null,null,"No","No","No",{"$f":"VLOOKUP(B801,'DOE Codes Lookups'!$A$3:$D$507,2,FALSE)","v":{"$error":"#N/A"}}]
[null,null,"() ",null,"1",null,null,"No","No","No",{"$f":"VLOOKUP(B802,'DOE Codes Lookups'!$A$3:$D$507,2,FALSE)","v":{"$error":"#N/A"}}]
[null,null,"() ",null,"1",null,null,"No","No","No",{"$f":"VLOOKUP(B803,'DOE Codes Lookups'!$A$3:$D$507,2,FALSE)","v":{"$error":"#N/A"}}]
[null,null,"() ",null,"1",null,null,"No","No","No",{"$f":"VLOOKUP(B804,'DOE Codes Lookups'!$A$3:$D$507,2,FALSE)","v":{"$error":"#N/A"}}]
[null,null,"() ",null,"1",null,null,"No","No","No",{"$f":"VLOOKUP(B805,'DOE Codes Lookups'!$A$3:$D$507,2,FALSE)","v":{"$error":"#N/A"}}]
[null,null,"() ",null,"1",null,null,"No","No","No",{"$f":"VLOOKUP(B806,'DOE Codes Lookups'!$A$3:$D$507,2,FALSE)","v":{"$error":"#N/A"}}]
[null,null,"() ",null,"1",null,null,"No","No","No",{"$f":"VLOOKUP(B807,'DOE Codes Lookups'!$A$3:$D$507,2,FALSE)","v":{"$error":"#N/A"}}]
[null,null,"() ",null,"1",null,null,"No","No","No",{"$f":"VLOOKUP(B808,'DOE Codes Lookups'!$A$3:$D$507,2,FALSE)","v":{"$error":"#N/A"}}]
[null,null,"() ",null,"1",null,null,"No","No","No",{"$f":"VLOOKUP(B809,'DOE Codes Lookups'!$A$3:$D$507,2,FALSE)","v":{"$error":"#N/A"}}]
[null,null,"() ",null,"1",null,null,"No","No","No",{"$f":"VLOOKUP(B810,'DOE Codes Lookups'!$A$3:$D$507,2,FALSE)","v":{"$error":"#N/A"}}]
[null,null,"() ",null,"1",null,null,"No","No","No",{"$f":"VLOOKUP(B811,'DOE Codes Lookups'!$A$3:$D$507,2,FALSE)","v":{"$error":"#N/A"}}]
[null,null,"() ",null,"1",null,null,"No","No","No",{"$f":"VLOOKUP(B812,'DOE Codes Lookups'!$A$3:$D$507,2,FALSE)","v":{"$error":"#N/A"}}]
[null,null,"() ",null,"1",null,null,"No","No","No",{"$f":"VLOOKUP(B813,'DOE Codes Lookups'!$A$3:$D$507,2,FALSE)","v":{"$error":"#N/A"}}]
[null,null,"() ",null,"1",null,null,"No","No","No",{"$f":"VLOOKUP(B814,'DOE Codes Lookups'!$A$3:$D$507,2,FALSE)","v":{"$error":"#N/A"}}]
[null,null,"() ",null,"1",null,null,"No","No","No",{"$f":"VLOOKUP(B815,'DOE Codes Lookups'!$A$3:$D$507,2,FALSE)","v":{"$error":"#N/A"}}]
[null,null,"() ",null,"1",null,null,"No","No","No",{"$f":"VLOOKUP(B816,'DOE Codes Lookups'!$A$3:$D$507,2,FALSE)","v":{"$error":"#N/A"}}]
[null,null,"() ",null,"1",null,null,"No","No","No",{"$f":"VLOOKUP(B817,'DOE Codes Lookups'!$A$3:$D$507,2,FALSE)","v":{"$error":"#N/A"}}]
[null,null,"() ",null,"1",null,null,"No","No","No",{"$f":"VLOOKUP(B818,'DOE Codes Lookups'!$A$3:$D$507,2,FALSE)","v":{"$error":"#N/A"}}]
[null,null,"() ",null,"1",null,null,"No","No","No",{"$f":"VLOOKUP(B819,'DOE Codes Lookups'!$A$3:$D$507,2,FALSE)","v":{"$error":"#N/A"}}]
[null,null,"() ",null,"1",null,null,"No","No","No",{"$f":"VLOOKUP(B820,'DOE Codes Lookups'!$A$3:$D$507,2,FALSE)","v":{"$error":"#N/A"}}]
[null,null,"() ",null,"1",null,null,"No","No","No",{"$f":"VLOOKUP(B821,'DOE Codes Lookups'!$A$3:$D$507,2,FALSE)","v":{"$error":"#N/A"}}]
[null,null,"() ",null,"1",null,null,"No","No","No",{"$f":"VLOOKUP(B822,'DOE Codes Lookups'!$A$3:$D$507,2,FALSE)","v":{"$error":"#N/A"}}]
[null,null,"() ",null,"1",null,null,"No","No","No",{"$f":"VLOOKUP(B823,'DOE Codes Lookups'!$A$3:$D$507,2,FALSE)","v":{"$error":"#N/A"}}]
[null,null,"() ",null,"1",null,null,"No","No","No",{"$f":"VLOOKUP(B824,'DOE Codes Lookups'!$A$3:$D$507,2,FALSE)","v":{"$error":"#N/A"}}]
[null,null,"() ",null,"1",null,null,"No","No","No",{"$f":"VLOOKUP(B825,'DOE Codes Lookups'!$A$3:$D$507,2,FALSE)","v":{"$error":"#N/A"}}]
[null,null,"() ",null,"1",null,null,"No","No","No",{"$f":"VLOOKUP(B826,'DOE Codes Lookups'!$A$3:$D$507,2,FALSE)","v":{"$error":"#N/A"}}]
[null,null,"() ",null,"1",null,null,"No","No","No",{"$f":"VLOOKUP(B827,'DOE Codes Lookups'!$A$3:$D$507,2,FALSE)","v":{"$error":"#N/A"}}]
[null,null,"() ",null,"1",null,null,"No","No","No",{"$f":"VLOOKUP(B828,'DOE Codes Lookups'!$A$3:$D$507,2,FALSE)","v":{"$error":"#N/A"}}]
[null,null,"() ",null,"1",null,null,"No","No","No",{"$f":"VLOOKUP(B829,'DOE Codes Lookups'!$A$3:$D$507,2,FALSE)","v":{"$error":"#N/A"}}]
[null,null,"() ",null,"1",null,null,"No","No","No",{"$f":"VLOOKUP(B830,'DOE Codes Lookups'!$A$3:$D$507,2,FALSE)","v":{"$error":"#N/A"}}]
[null,null,"() ",null,"1",null,null,"No","No","No",{"$f":"VLOOKUP(B831,'DOE Codes Lookups'!$A$3:$D$507,2,FALSE)","v":{"$error":"#N/A"}}]
[null,null,"() ",null,"1",null,null,"No","No","No",{"$f":"VLOOKUP(B832,'DOE Codes Lookups'!$A$3:$D$507,2,FALSE)","v":{"$error":"#N/A"}}]
[null,null,"() ",null,"1",null,null,"No","No","No",{"$f":"VLOOKUP(B833,'DOE Codes Lookups'!$A$3:$D$507,2,FALSE)","v":{"$error":"#N/A"}}]
[null,null,{"$f":"CONCATENATE(\"(\",B834,\") \",D834)","v":"() "},null,{"$f":"IF(H834=\"no\",\"1\",IF(AND(H834=\"Yes\",I834=\"No\",J834=\"No\"),\"3\",IF(AND(H834=\"Yes\",I834=\"Yes\",J834=\"Yes\"),\"2\",IF(AND(H834=\"Yes\",I834=\"Yes\",J834=\"No\"),\"5\",IF(AND(H834=\"Yes\",I834=\"No\",J834=\"Yes\"),\"4\",\"0\")))))","v":"1"},null,null,{"$f":"IFERROR(VLOOKUP(B834,PSICFL_1819a,2,FALSE),\"No\")","v":"No"},{"$f":"IFERROR(VLOOKUP(B834,PSICFL_1819a,5,FALSE),\"No\")","v":"No"},{"$f":"IFERROR(VLOOKUP(B834,PSICFL_1819a,3,FALSE),\"No\")","v":"No"},{"$f":"VLOOKUP(B834,'DOE Codes Lookups'!$A$3:$D$507,2,FALSE)","v":{"$error":"#N/A"}}]
[null,null,"() ",null,"1",null,null,"No","No","No",{"$f":"VLOOKUP(B835,'DOE Codes Lookups'!$A$3:$D$507,2,FALSE)","v":{"$error":"#N/A"}}]
[null,null,"() ",null,"1",null,null,"No","No","No",{"$f":"VLOOKUP(B836,'DOE Codes Lookups'!$A$3:$D$507,2,FALSE)","v":{"$error":"#N/A"}}]
[null,null,"() ",null,"1",null,null,"No","No","No",{"$f":"VLOOKUP(B837,'DOE Codes Lookups'!$A$3:$D$507,2,FALSE)","v":{"$error":"#N/A"}}]
[null,null,"() ",null,"1",null,null,"No","No","No",{"$f":"VLOOKUP(B838,'DOE Codes Lookups'!$A$3:$D$507,2,FALSE)","v":{"$error":"#N/A"}}]
[null,null,"() ",null,"1",null,null,"No","No","No",{"$f":"VLOOKUP(B839,'DOE Codes Lookups'!$A$3:$D$507,2,FALSE)","v":{"$error":"#N/A"}}]
[null,null,"() ",null,"1",null,null,"No","No","No",{"$f":"VLOOKUP(B840,'DOE Codes Lookups'!$A$3:$D$507,2,FALSE)","v":{"$error":"#N/A"}}]
[null,null,"() ",null,"1",null,null,"No","No","No",{"$f":"VLOOKUP(B841,'DOE Codes Lookups'!$A$3:$D$507,2,FALSE)","v":{"$error":"#N/A"}}]
[null,null,"() ",null,"1",null,null,"No","No","No",{"$f":"VLOOKUP(B842,'DOE Codes Lookups'!$A$3:$D$507,2,FALSE)","v":{"$error":"#N/A"}}]
[null,null,"() ",null,"1",null,null,"No","No","No",{"$f":"VLOOKUP(B843,'DOE Codes Lookups'!$A$3:$D$507,2,FALSE)","v":{"$error":"#N/A"}}]
[null,null,"() ",null,"1",null,null,"No","No","No",{"$f":"VLOOKUP(B844,'DOE Codes Lookups'!$A$3:$D$507,2,FALSE)","v":{"$error":"#N/A"}}]
[null,null,"() ",null,"1",null,null,"No","No","No",{"$f":"VLOOKUP(B845,'DOE Codes Lookups'!$A$3:$D$507,2,FALSE)","v":{"$error":"#N/A"}}]
[null,null,"() ",null,"1",null,null,"No","No","No",{"$f":"VLOOKUP(B846,'DOE Codes Lookups'!$A$3:$D$507,2,FALSE)","v":{"$error":"#N/A"}}]
[null,null,"() ",null,"1",null,null,"No","No","No",{"$f":"VLOOKUP(B847,'DOE Codes Lookups'!$A$3:$D$507,2,FALSE)","v":{"$error":"#N/A"}}]
[null,null,"() ",null,"1",null,null,"No","No","No",{"$f":"VLOOKUP(B848,'DOE Codes Lookups'!$A$3:$D$507,2,FALSE)","v":{"$error":"#N/A"}}]
[null,null,"() ",null,"1",null,null,"No","No","No",{"$f":"VLOOKUP(B849,'DOE Codes Lookups'!$A$3:$D$507,2,FALSE)","v":{"$error":"#N/A"}}]
[null,null,"() ",null,"1",null,null,"No","No","No",{"$f":"VLOOKUP(B850,'DOE Codes Lookups'!$A$3:$D$507,2,FALSE)","v":{"$error":"#N/A"}}]
[null,null,"() ",null,"1",null,null,"No","No","No",{"$f":"VLOOKUP(B851,'DOE Codes Lookups'!$A$3:$D$507,2,FALSE)","v":{"$error":"#N/A"}}]
[null,null,"() ",null,"1",null,null,"No","No","No",{"$f":"VLOOKUP(B852,'DOE Codes Lookups'!$A$3:$D$507,2,FALSE)","v":{"$error":"#N/A"}}]
[null,null,"() ",null,"1",null,null,"No","No","No",{"$f":"VLOOKUP(B853,'DOE Codes Lookups'!$A$3:$D$507,2,FALSE)","v":{"$error":"#N/A"}}]
[null,null,"() ",null,"1",null,null,"No","No","No",{"$f":"VLOOKUP(B854,'DOE Codes Lookups'!$A$3:$D$507,2,FALSE)","v":{"$error":"#N/A"}}]
[null,null,"() ",null,"1",null,null,"No","No","No",{"$f":"VLOOKUP(B855,'DOE Codes Lookups'!$A$3:$D$507,2,FALSE)","v":{"$error":"#N/A"}}]
[null,null,"() ",null,"1",null,null,"No","No","No",{"$f":"VLOOKUP(B856,'DOE Codes Lookups'!$A$3:$D$507,2,FALSE)","v":{"$error":"#N/A"}}]
[null,null,"() ",null,"1",null,null,"No","No","No",{"$f":"VLOOKUP(B857,'DOE Codes Lookups'!$A$3:$D$507,2,FALSE)","v":{"$error":"#N/A"}}]
[null,null,"() ",null,"1",null,null,"No","No","No",{"$f":"VLOOKUP(B858,'DOE Codes Lookups'!$A$3:$D$507,2,FALSE)","v":{"$error":"#N/A"}}]
[null,null,"() ",null,"1",null,null,"No","No","No",{"$f":"VLOOKUP(B859,'DOE Codes Lookups'!$A$3:$D$507,2,FALSE)","v":{"$error":"#N/A"}}]
[null,null,"() ",null,"1",null,null,"No","No","No",{"$f":"VLOOKUP(B860,'DOE Codes Lookups'!$A$3:$D$507,2,FALSE)","v":{"$error":"#N/A"}}]
[null,null,"() ",null,"1",null,null,"No","No","No",{"$f":"VLOOKUP(B861,'DOE Codes Lookups'!$A$3:$D$507,2,FALSE)","v":{"$error":"#N/A"}}]
[null,null,"() ",null,"1",null,null,"No","No","No",{"$f":"VLOOKUP(B862,'DOE Codes Lookups'!$A$3:$D$507,2,FALSE)","v":{"$error":"#N/A"}}]
[null,null,"() ",null,"1",null,null,"No","No","No",{"$f":"VLOOKUP(B863,'DOE Codes Lookups'!$A$3:$D$507,2,FALSE)","v":{"$error":"#N/A"}}]
[null,null,"() ",null,"1",null,null,"No","No","No",{"$f":"VLOOKUP(B864,'DOE Codes Lookups'!$A$3:$D$507,2,FALSE)","v":{"$error":"#N/A"}}]
[null,null,"() ",null,"1",null,null,"No","No","No",{"$f":"VLOOKUP(B865,'DOE Codes Lookups'!$A$3:$D$507,2,FALSE)","v":{"$error":"#N/A"}}]
[null,null,"() ",null,"1",null,null,"No","No","No",{"$f":"VLOOKUP(B866,'DOE Codes Lookups'!$A$3:$D$507,2,FALSE)","v":{"$error":"#N/A"}}]
[null,null,"() ",null,"1",null,null,"No","No","No",{"$f":"VLOOKUP(B867,'DOE Codes Lookups'!$A$3:$D$507,2,FALSE)","v":{"$error":"#N/A"}}]
[null,null,"() ",null,"1",null,null,"No","No","No",{"$f":"VLOOKUP(B868,'DOE Codes Lookups'!$A$3:$D$507,2,FALSE)","v":{"$error":"#N/A"}}]
[null,null,"() ",null,"1",null,null,"No","No","No",{"$f":"VLOOKUP(B869,'DOE Codes Lookups'!$A$3:$D$507,2,FALSE)","v":{"$error":"#N/A"}}]
[null,null,"() ",null,"1",null,null,"No","No","No",{"$f":"VLOOKUP(B870,'DOE Codes Lookups'!$A$3:$D$507,2,FALSE)","v":{"$error":"#N/A"}}]
[null,null,"() ",null,"1",null,null,"No","No","No",{"$f":"VLOOKUP(B871,'DOE Codes Lookups'!$A$3:$D$507,2,FALSE)","v":{"$error":"#N/A"}}]
[null,null,"() ",null,"1",null,null,"No","No","No",{"$f":"VLOOKUP(B872,'DOE Codes Lookups'!$A$3:$D$507,2,FALSE)","v":{"$error":"#N/A"}}]
[null,null,"() ",null,"1",null,null,"No","No","No",{"$f":"VLOOKUP(B873,'DOE Codes Lookups'!$A$3:$D$507,2,FALSE)","v":{"$error":"#N/A"}}]
[null,null,"() ",null,"1",null,null,"No","No","No",{"$f":"VLOOKUP(B874,'DOE Codes Lookups'!$A$3:$D$507,2,FALSE)","v":{"$error":"#N/A"}}]
[null,null,"() ",null,"1",null,null,"No","No","No",{"$f":"VLOOKUP(B875,'DOE Codes Lookups'!$A$3:$D$507,2,FALSE)","v":{"$error":"#N/A"}}]
[null,null,"() ",null,"1",null,null,"No","No","No",{"$f":"VLOOKUP(B876,'DOE Codes Lookups'!$A$3:$D$507,2,FALSE)","v":{"$error":"#N/A"}}]
[null,null,"() ",null,"1",null,null,"No","No","No",{"$f":"VLOOKUP(B877,'DOE Codes Lookups'!$A$3:$D$507,2,FALSE)","v":{"$error":"#N/A"}}]
[null,null,"() ",null,"1",null,null,"No","No","No",{"$f":"VLOOKUP(B878,'DOE Codes Lookups'!$A$3:$D$507,2,FALSE)","v":{"$error":"#N/A"}}]
[null,null,"() ",null,"1",null,null,"No","No","No",{"$f":"VLOOKUP(B879,'DOE Codes Lookups'!$A$3:$D$507,2,FALSE)","v":{"$error":"#N/A"}}]
[null,null,"() ",null,"1",null,null,"No","No","No",{"$f":"VLOOKUP(B880,'DOE Codes Lookups'!$A$3:$D$507,2,FALSE)","v":{"$error":"#N/A"}}]
[null,null,"() ",null,"1",null,null,"No","No","No",{"$f":"VLOOKUP(B881,'DOE Codes Lookups'!$A$3:$D$507,2,FALSE)","v":{"$error":"#N/A"}}]
[null,null,"() ",null,"1",null,null,"No","No","No",{"$f":"VLOOKUP(B882,'DOE Codes Lookups'!$A$3:$D$507,2,FALSE)","v":{"$error":"#N/A"}}]
[null,null,"() ",null,"1",null,null,"No","No","No",{"$f":"VLOOKUP(B883,'DOE Codes Lookups'!$A$3:$D$507,2,FALSE)","v":{"$error":"#N/A"}}]
[null,null,"() ",null,"1",null,null,"No","No","No",{"$f":"VLOOKUP(B884,'DOE Codes Lookups'!$A$3:$D$507,2,FALSE)","v":{"$error":"#N/A"}}]
[null,null,"() ",null,"1",null,null,"No","No","No",{"$f":"VLOOKUP(B885,'DOE Codes Lookups'!$A$3:$D$507,2,FALSE)","v":{"$error":"#N/A"}}]
[null,null,"() ",null,"1",null,null,"No","No","No",{"$f":"VLOOKUP(B886,'DOE Codes Lookups'!$A$3:$D$507,2,FALSE)","v":{"$error":"#N/A"}}]
[null,null,"() ",null,"1",null,null,"No","No","No",{"$f":"VLOOKUP(B887,'DOE Codes Lookups'!$A$3:$D$507,2,FALSE)","v":{"$error":"#N/A"}}]
[null,null,"() ",null,"1",null,null,"No","No","No",{"$f":"VLOOKUP(B888,'DOE Codes Lookups'!$A$3:$D$507,2,FALSE)","v":{"$error":"#N/A"}}]
[null,null,"() ",null,"1",null,null,"No","No","No",{"$f":"VLOOKUP(B889,'DOE Codes Lookups'!$A$3:$D$507,2,FALSE)","v":{"$error":"#N/A"}}]
[null,null,"() ",null,"1",null,null,"No","No","No",{"$f":"VLOOKUP(B890,'DOE Codes Lookups'!$A$3:$D$507,2,FALSE)","v":{"$error":"#N/A"}}]
[null,null,"() ",null,"1",null,null,"No","No","No",{"$f":"VLOOKUP(B891,'DOE Codes Lookups'!$A$3:$D$507,2,FALSE)","v":{"$error":"#N/A"}}]
[null,null,"() ",null,"1",null,null,"No","No","No",{"$f":"VLOOKUP(B892,'DOE Codes Lookups'!$A$3:$D$507,2,FALSE)","v":{"$error":"#N/A"}}]
[null,null,"() ",null,"1",null,null,"No","No","No",{"$f":"VLOOKUP(B893,'DOE Codes Lookups'!$A$3:$D$507,2,FALSE)","v":{"$error":"#N/A"}}]
[null,null,"() ",null,"1",null,null,"No","No","No",{"$f":"VLOOKUP(B894,'DOE Codes Lookups'!$A$3:$D$507,2,FALSE)","v":{"$error":"#N/A"}}]
[null,null,"() ",null,"1",null,null,"No","No","No",{"$f":"VLOOKUP(B895,'DOE Codes Lookups'!$A$3:$D$507,2,FALSE)","v":{"$error":"#N/A"}}]
[null,null,"() ",null,"1",null,null,"No","No","No",{"$f":"VLOOKUP(B896,'DOE Codes Lookups'!$A$3:$D$507,2,FALSE)","v":{"$error":"#N/A"}}]
[null,null,"() ",null,"1",null,null,"No","No","No",{"$f":"VLOOKUP(B897,'DOE Codes Lookups'!$A$3:$D$507,2,FALSE)","v":{"$error":"#N/A"}}]
[null,null,{"$f":"CONCATENATE(\"(\",B898,\") \",D898)","v":"() "},null,{"$f":"IF(H898=\"no\",\"1\",IF(AND(H898=\"Yes\",I898=\"No\",J898=\"No\"),\"3\",IF(AND(H898=\"Yes\",I898=\"Yes\",J898=\"Yes\"),\"2\",IF(AND(H898=\"Yes\",I898=\"Yes\",J898=\"No\"),\"5\",IF(AND(H898=\"Yes\",I898=\"No\",J898=\"Yes\"),\"4\",\"0\")))))","v":"1"},null,null,{"$f":"IFERROR(VLOOKUP(B898,PSICFL_1819a,2,FALSE),\"No\")","v":"No"},{"$f":"IFERROR(VLOOKUP(B898,PSICFL_1819a,5,FALSE),\"No\")","v":"No"},{"$f":"IFERROR(VLOOKUP(B898,PSICFL_1819a,3,FALSE),\"No\")","v":"No"},{"$f":"VLOOKUP(B898,'DOE Codes Lookups'!$A$3:$D$507,2,FALSE)","v":{"$error":"#N/A"}}]
[null,null,"() ",null,"1",null,null,"No","No","No",{"$f":"VLOOKUP(B899,'DOE Codes Lookups'!$A$3:$D$507,2,FALSE)","v":{"$error":"#N/A"}}]
[null,null,"() ",null,"1",null,null,"No","No","No",{"$f":"VLOOKUP(B900,'DOE Codes Lookups'!$A$3:$D$507,2,FALSE)","v":{"$error":"#N/A"}}]
[null,null,"() ",null,"1",null,null,"No","No","No",{"$f":"VLOOKUP(B901,'DOE Codes Lookups'!$A$3:$D$507,2,FALSE)","v":{"$error":"#N/A"}}]
[null,null,"() ",null,"1",null,null,"No","No","No",{"$f":"VLOOKUP(B902,'DOE Codes Lookups'!$A$3:$D$507,2,FALSE)","v":{"$error":"#N/A"}}]
[null,null,"() ",null,"1",null,null,"No","No","No",{"$f":"VLOOKUP(B903,'DOE Codes Lookups'!$A$3:$D$507,2,FALSE)","v":{"$error":"#N/A"}}]
[null,null,"() ",null,"1",null,null,"No","No","No",{"$f":"VLOOKUP(B904,'DOE Codes Lookups'!$A$3:$D$507,2,FALSE)","v":{"$error":"#N/A"}}]
[null,null,"() ",null,"1",null,null,"No","No","No",{"$f":"VLOOKUP(B905,'DOE Codes Lookups'!$A$3:$D$507,2,FALSE)","v":{"$error":"#N/A"}}]
[null,null,"() ",null,"1",null,null,"No","No","No",{"$f":"VLOOKUP(B906,'DOE Codes Lookups'!$A$3:$D$507,2,FALSE)","v":{"$error":"#N/A"}}]
[null,null,"() ",null,"1",null,null,"No","No","No",{"$f":"VLOOKUP(B907,'DOE Codes Lookups'!$A$3:$D$507,2,FALSE)","v":{"$error":"#N/A"}}]
[null,null,"() ",null,"1",null,null,"No","No","No",{"$f":"VLOOKUP(B908,'DOE Codes Lookups'!$A$3:$D$507,2,FALSE)","v":{"$error":"#N/A"}}]
[null,null,"() ",null,"1",null,null,"No","No","No",{"$f":"VLOOKUP(B909,'DOE Codes Lookups'!$A$3:$D$507,2,FALSE)","v":{"$error":"#N/A"}}]
[null,null,"() ",null,"1",null,null,"No","No","No",{"$f":"VLOOKUP(B910,'DOE Codes Lookups'!$A$3:$D$507,2,FALSE)","v":{"$error":"#N/A"}}]
[null,null,"() ",null,"1",null,null,"No","No","No",{"$f":"VLOOKUP(B911,'DOE Codes Lookups'!$A$3:$D$507,2,FALSE)","v":{"$error":"#N/A"}}]
[null,null,"() ",null,"1",null,null,"No","No","No",{"$f":"VLOOKUP(B912,'DOE Codes Lookups'!$A$3:$D$507,2,FALSE)","v":{"$error":"#N/A"}}]
[null,null,"() ",null,"1",null,null,"No","No","No",{"$f":"VLOOKUP(B913,'DOE Codes Lookups'!$A$3:$D$507,2,FALSE)","v":{"$error":"#N/A"}}]
[null,null,"() ",null,"1",null,null,"No","No","No",{"$f":"VLOOKUP(B914,'DOE Codes Lookups'!$A$3:$D$507,2,FALSE)","v":{"$error":"#N/A"}}]
[null,null,"() ",null,"1",null,null,"No","No","No",{"$f":"VLOOKUP(B915,'DOE Codes Lookups'!$A$3:$D$507,2,FALSE)","v":{"$error":"#N/A"}}]
[null,null,"_"]

{"sheet":"Certifications","index":6,"n_rows":539,"n_cols":4,"rows_kept":539,"cut":false,"hidden":false,"merged":[]}
["DOE Code","Certification Title","Certification Agency","Agency Website"]
["AAMIN001","Certified Biomedical Equipment Technician","Association for the Advancement of Medical Instrumentation (AAMI)","www.aami.org/certification/"]
["AAVSB001","Veterinary Technician","American Association of Veterinary State Boards","www.aavsb.org/"]
["ABAYC001","Composite Boat Builder Certification","American Boat & Yacht Council","www.abycinc.org/"]
["ABAYC002","Marine Diesel Certification","American Boat & Yacht Council","www.abycinc.org/"]
["ABAYC003","Marine Electrical Certification","American Boat & Yacht Council","www.abycinc.org/"]
["ABAYC005","Marine Systems Certification","American Boat & Yacht Council","www.abycinc.org/"]
["ABAYC006","A/C Refrigeration Certification","American Boat & Yacht Council","www.abycinc.org/"]
["ABAYC007","Marine Corrosion Certification","American Boat & Yacht Council","www.abycinc.org/"]
["ABCOP001","Certified Prosthetic (and/or) Orthotic Technician (CTPO)","American Board for Certification in Orthotics, Prosthetics & Pedorthics","www.abcop.org"]
["ABRET001","Registered EEG Technologist (R. EEG T.)","American Board of Registration of Electroencephalographic and Evoked Potential Technologists","www.abret.org/"]
["ACFAT001","Accredited Business Accountant (ABA)","Accreditation Council for Accountancy & Taxation","www.acatcredentials.org"]
["ACFED001","Certified Chef de Cuisine","American Culinary Federation","www.acfchefs.org"]
["ACFED002","Certified Culinarian (CC)","American Culinary Federation","www.acfchefs.org"]
["ACFED006","Certified Fundamentals Cook","American Culinary Federation","www.acfchefs.org"]
["ACOPC001","Certified Professional Coder (CPC - Apprentice)","American Academy of Professional Coders","www.aapc.com/"]
["ACOPC004","Certified Outpatient Coder (COC)","American Academy of Professional Coders","www.aapc.com/"]
["ACOPC005","Certified Professional Coder - Payer (CPC-P)","American Academy of Professional Coders","www.aapc.com/"]
["ACOPC006","Certified Professional Coder (CPC)","American Academy of Professional Coders","www.aapc.com/"]
["ACOPC007","Certified Professional Biller (CPB)","American Academy of Professional Coders","www.aapc.com/"]
["ACOSM001","Certified Survey Technician (CST)","American Congress on Surveying and Mapping - National Society of Professional Surveyors","www.acsm.net"]
["ACSMD002","Certified Personal Trainer","American College of Sports Medicine","www.acsm.org"]
["ADESK002","Autodesk Certified User - AutoCAD","Autodesk","www.autodesk.com"]
["ADESK008","Autodesk Certified User - Revit Architecture","Autodesk","www.autodesk.com"]
["ADESK011","Autodesk Certified User - Inventor","Autodesk","www.autodesk.com"]
["ADESK021","Autodesk Certified Professional - AutoCAD","Autodesk","www.autodesk.com"]
["ADESK023","Autodesk Certified Professional - AutoCAD Civil 3D","Autodesk","www.autodesk.com"]
["ADESK024","Autodesk Certified Professional - Inventor","Autodesk","www.autodesk.com"]
["ADESK025","Autodesk Certified Professional - Revit Architecture","Autodesk","www.autodesk.com"]
["ADESK030","Autodesk Certified User - Maya","Autodesk","www.autodesk.com"]
["ADESK032","Autodesk Certified User - Fusion 360","Autodesk","www.autodesk.com"]
["ADOBE002","Adobe Certified Expert (ACE) - After Effects","Adobe Systems","www.adobe.com"]
["ADOBE003","Adobe Certified Expert (ACE) - Illustrator","Adobe Systems","www.adobe.com"]
["ADOBE004","Adobe Certified Expert (ACE) - InDesign","Adobe Systems","www.adobe.com"]
["ADOBE005","Adobe Certified Expert (ACE) - Photoshop","Adobe Systems","www.adobe.com"]
["ADOBE007","Adobe Certified Expert (ACE) - Premiere Pro","Adobe Systems","www.adobe.com"]
["ADOBE010","Adobe Certified Associate (ACA) - Dreamweaver","Adobe Systems","www.adobe.com"]
["ADOBE011","Adobe Certified Associate (ACA) - Flash/Animate","Adobe Systems","www.adobe.com"]
["ADOBE013","Adobe Certified Expert (ACE) - Acrobat","Adobe Systems","www.adobe.com"]
["ADOBE018","Adobe Certified Associate (ACA) - Premiere Pro","Adobe Systems","www.adobe.com"]
["ADOBE019","Adobe Certified Expert (ACE) - Dreamweaver","Adobe Systems","www.adobe.com"]
["ADOBE020","Adobe Certified Associate (ACA) - Illustrator","Adobe Systems","www.adobe.com"]
["ADOBE021","Adobe Certified Associate (ACA) - InDesign","Adobe Systems","www.adobe.com"]
["ADOBE022","Adobe Certified Associate (ACA) - Photoshop (Creative Cloud 2015 or later)","Adobe Systems","www.adobe.com"]
["ADOBE023","Adobe Certified Associate (ACA) Video Design Specialist \n(Requires two of the following: After Effects, Premiere Pro, Photoshop)","Adobe Systems","www.adobe.com"]
["ADOBE024","Adobe Certified Associate (ACA) Visual Design Specialist\n(Requires two of the following: Illustrator, InDesign, Photoshop)","Adobe Systems","www.adobe.com"]
["ADOBE025","Adobe Certified Associate (ACA) Web Design Specialist\n(Requires two of the following: Animate, Dreamweaver and Photoshop)","Adobe Systems","www.adobe.com"]
["AFHDI001","Certified Healthcare Documentation Specialist (CHDS)","Association for Healthcare Documentation Integrity (AHDI)","www.ahdionline.org"]
["AFHDI002","Registered Healthcare Documentation Specialist (RHDS)","Association for Healthcare Documentation Integrity (AHDI)","www.ahdionline.org"]
["AHCSM001","Certified Registered Central Service Technician","International Association of Healthcare Central Service Material Management","iahcsmm.org/"]
["AHIMA001","Certified Coding Associate (CCA)","American Health Information Management Association","www.ahima.org"]
["AHIMA002","Certified Coding Specialist (CCS)","American Health Information Management Association","www.ahima.org"]
["AHIMA003","Certified Coding Specialist - Physician-based (CCS-P)","American Health Information Management Association","www.ahima.org"]
["AHIMA007","Registered Health Information Administrator (RHIA)","American Health Information Management Association","www.ahima.org"]
["AHIMA009","Registered Health Information Technician (RHIT)","American Health Information Management Association","www.ahima.org"]
["AHIMA010","Certified in Health Care Privacy & Security (CHPS)","American Health Information Management Association","www.ahima.org"]
["AHIMA011","Certified Healthcare Technology Specialist - Clinician/Practitioner Consultant (CHTS-CP)","American Health Information Management Association","www.ahima.org"]
["AHIMA012","Certified Healthcare Technology Specialist - Implementation Manager (CHTS-IM)","American Health Information Management Association","www.ahima.org"]
["AHIMA013","Certified Healthcare Technology Specialist - Implementation Support Specialist (CHTS-IS)","American Health Information Management Association","www.ahima.org"]
["AHIMA014","Certified Healthcare Technology Specialist - Practice Workflow & Information Management Redesign Specialist (CHTS-PW)","American Health Information Management Association","www.ahima.org"]
["AHIMA015","Certified Healthcare Technology Specialist - Technical/Software Support Staff (CHTS-TS)","American Health Information Management Association","www.ahima.org"]
["AHIMA016","Certified Healthcare Technology Specialist - Trainer (CHTS-TR)","American Health Information Management Association","www.ahima.org"]
["AHIMA017","Certified Documentation Improvement Practitioner (CDIP)","American Health Information Management Association","www.ahima.org"]
["AHIMA018","Certified Health Data Analyst (CHDA)","American Health Information Management Association","www.ahima.org"]
["AHLAE002","Hospitality Industry Knowledge (U.S.) ","American Hotel and Lodging Association Educational Institute","www.ahlei.org"]
["AHLAE011","Certified Hospitality Supervisor (CHS)","American Hotel and Lodging Association Educational Institute","www.ahlei.org"]
["AIOPB001","Certified Bookkeeper","American Institute of Professional Bookkeepers","www.aipb.org"]
["AMAMA001","Certified Medical Assistant (CMA)","American Association of Medical Assistants","www.aama-ntl.org"]
["AMAOB001","Medical Laboratory Technician (MLT) ","American Association of Bioanalysts (AAB)","www.aab.org"]
["AMAOB002","Medical Technologist (MT(AAB))","American Association of Bioanalysts (AAB)","www.aab.org"]
["AMAZN001","AWS Certified Solutions Architect - Associate","Amazon","www.amazon.com"]
["AMAZN002","AWS Certified Cloud Practitioner","Amazon","www.amazon.com"]
["AMCMA001","Certified Composites Technician","American Composites Manufacturers Association","www.acmanet.org"]
["AMDDA002","Certified Apprentice Drafter - Architectural","American Design Drafting Association","www.adda.org"]
["AMDDA003","Certified Drafter - Architectural","American Design Drafting Association","www.adda.org"]
["AMDDA004","Certified Drafter - Mechanical","American Design Drafting Association","www.adda.org"]
["AMDDA005","Certified Apprentice Drafter - Mechanical","American Design Drafting Association","www.adda.org"]
["AMEDT002","Medical Laboratory Technician","American Medical Technologists (AMT)","https://www.americanmedtech.org/"]
["AMEDT004","Registered Medical Assistant (RMA)","American Medical Technologists (AMT)","https://www.americanmedtech.org/"]
["AMEDT005","Registered Phlebotomy Technician (RPT)","American Medical Technologists (AMT)","https://www.americanmedtech.org/"]
["AMEDT006","Medical Laboratory Assistant (CMLA)","American Medical Technologists (AMT)","https://www.americanmedtech.org/"]
["AMOPT001","Certified Paraoptometric Assistant (CPOA)","American Optometric Association","www.aoa.org/x4931.xml"]
["AMRRT002","Registered Technologist (Radiography)","American Registry of Radiologic Technologists","www.arrt.org"]
["AMRRT003","Radiologic Technologist (Sonography)","American Registry of Radiologic Technologists","www.arrt.org"]
["AMRRT005","Registered Technologist - Quality Management (R.T.)","American Registry of Radiologic Technologists","www.arrt.org"]
["AMRRT006","Registered Technologist (Nuclear Medicine)","American Registry of Radiologic Technologists","www.arrt.org"]
["AMRRT007","Registered Technologist (Radiation Therapy)","American Registry of Radiologic Technologists","www.arrt.org"]
["AMRRT008","Computed Tomography (CT)","American Registry of Radiologic Technologists","www.arrt.org"]
["AMSCP001","Histotechnologist, HTL(ASCP)","American Society of Clinical Pathology","www.ascp.org"]
["AMSCP002","Medical Laboratory Technician (MLT(ASCP))","American Society of Clinical Pathology","www.ascp.org"]
["AMSFQ001","Manager of Quality/Organizational Excellence","American Society for Quality","www.asq.org"]
["AMSFQ006","Quality Improvement Associate (CQIA)","American Society for Quality","www.asq.org"]
["AMSFQ011","Six Sigma Black Belt (CSSBB)","American Society for Quality","www.asq.org"]
["AMSFQ012","Six Sigma Green Belt (CSSGB)","American Society for Quality","www.asq.org"]
["AMSPT002","Certified Phlebotomy Technician","American Society of Phlebotomy Technicians","www.aspt.org"]
["AMSTL004","Professional Designation in Supply Chain Management (PLS)","American Production and Inventory Control Society (APICS)","www.astl.org"]
["APICS001","Certified in Logistics, Transportation, and Distribution (CLTD)","American Production and Inventory Control Society (APICS)","www.apics.org"]
["APPLE002","Apple Certified Technical Coordinator","Apple, Inc.","training.apple.com"]
["APPLE019","Apple Certified Support Professional","Apple, Inc.","training.apple.com"]
["APPLE020","Apple Certified Pro (ACP) - Final Cut Pro X","Apple, Inc.","training.apple.com"]
["APPLE021","Apple App Development with Swift Certification Level 1","Apple, Inc.","training.apple.com"]
["APSCO001","Emergency Medical Dispatcher","APCO Institute","www.apcointl.org/institute/courses/emd.htm"]
["ARDMS001","Registered Diagnostic Cardiac Sonographer (RDCS)","American Registry for Diagnostic Medical Sonography","www.ardms.org"]
["ARDMS002","Registered Diagnostic Medical Sonographer (RDMS)","American Registry for Diagnostic Medical Sonography","www.ardms.org"]
["ARDMS003","Registered Vascular Technologist","American Registry for Diagnostic Medical Sonography","www.ardms.org"]
["AWELD003","AWS Certified Welder - FCAW Plate","American Welding Society","www.aws.org"]
["AWELD004","AWS Certified Welder - GMAW Plate","American Welding Society","www.aws.org"]
["AWELD005","AWS Certified Welder - GTAW Pipe (Carbon Steel)","American Welding Society","www.aws.org"]
["AWELD006","AWS Certified Welder - GTAW Pipe (Stainless Steel to Carbon Steel)","American Welding Society","www.aws.org"]
["AWELD007","AWS Certified Welder - GTAW Pipe (Stainless Steel)","American Welding Society","www.aws.org"]
["AWELD008","AWS Certified Welder - GTAW Plate","American Welding Society","www.aws.org"]
["AWELD009","AWS Certified Welder - GTAW/SMAW Pipe (Carbon Steel)","American Welding Society","www.aws.org"]
["AWELD010","AWS Certified Welder - GTAW/SMAW Pipe (Chrome PWHT)","American Welding Society","www.aws.org"]
["AWELD011","AWS Certified Welder - SMAW Pipe","American Welding Society","www.aws.org"]
["AWELD012","AWS Certified Welder - SMAW Plate","American Welding Society","www.aws.org"]
["BNENT001","Certified Hemodialysis Technologist/Technician","Board of Nephrology Examiners Inc. Nursing and Technology","www.bonent.org/"]
["CARCH002","Chief Architect Certified Apprentice","Chief Architect, Inc.","www.chiefarchitect.com"]
["CBFDM001","Certified Dietary Manager (CDM)","Certifying Board for Dietary Managers","www.dmaonline.org/"]
["CCINT002","Registered Cardiac Sonographer (RCS)","Cardiovascular Credentialing International","www.cci-online.org"]
["CCINT003","Registered Cardiovascular Invasive Specialist","Cardiovascular Credentialing International","www.cci-online.org"]
["CCINT004","Registered Vascular Specialist","Cardiovascular Credentialing International","www.cci-online.org"]
["CDREG001","Dietetic Technician, Registered (DTR)","Commission on Dietetic Registration","www.cdrnet.org/"]
["CDREG002","Registered Dietician","Commission on Dietetic Registration","www.cdrnet.org/"]
["CERHB001","Biotechnician Assistant","Center for Excellence for Regenerative Health Biotechnology at University of Florida","http://www.cerhb.ufl.edu/"]
["CERTI002","Entrepreneurship & Small Business","Certiport, A Pearson VUE Business","www.certiport.com"]
["CEWFD001","Energy Industry Fundamentals Certificate","Center for Energy Workforce Development","http://www.cewd.org/curriculum"]
["CIDIN001","Certified Interior Decorator","Certified Interior Decorators International (C.I.D.)","www.cidinternational.org"]
["CINST001","C++ Certified Associate Programmer (CPA)","C++ Institute","http://cppinstitute.org/"]
["CISCO001","Cisco Certified Design Associate (CCDA)","Cisco Systems, Inc.","www.cisco.com"]
["CISCO002","Cisco Certified Design Professional (CCDP)","Cisco Systems, Inc.","www.cisco.com"]
["CISCO003","Cisco Certified Entry Network Technician (CCENT)","Cisco Systems, Inc.","www.cisco.com"]
["CISCO004","Cisco Certified Network Associate (CCNA)","Cisco Systems, Inc.","www.cisco.com"]
["CISCO005","Cisco Certified Network Professional (CCNP)","Cisco Systems, Inc.","www.cisco.com"]
["CISCO009","Cisco Certified Architect","Cisco Systems, Inc.","www.cisco.com"]
["CISCO010","Cisco Certified Design Expert (CCDE)","Cisco Systems, Inc.","www.cisco.com"]
["CISCO011","Cisco Certified Network Associate Security (CCNA Security)","Cisco Systems, Inc.","www.cisco.com"]
["CISCO013","Cisco Certified Network Associate Wireless (CCNA Wireless)","Cisco Systems, Inc.","www.cisco.com"]
["CISCO017","Cisco Certified Network Professional Wireless (CCNP Wireless)","Cisco Systems, Inc.","www.cisco.com"]
["CISCO018","Cisco Certified Internetwork Expert Routing and Switching (CCIE Routing & Switching)","Cisco Systems, Inc.","www.cisco.com"]
["CISCO019","Cisco Certified Internetwork Expert Security (CCIE Security)","Cisco Systems, Inc.","www.cisco.com"]
["CISCO024","Cisco Certified Network Associate Routing and Switching (CCNA Routing and Switching)","Cisco Systems, Inc.","www.cisco.com"]
["CISCO025","Cisco Certified Network Associate Cyber Ops (CCNA Cyber Ops)","Cisco Systems, Inc.","www.cisco.com"]
["CISCO026","Cisco Certified Network Associate (CCNA)","Cisco Systems","www.cisco.com"]
["CITRX004","Citrix Certified Administrator (CCA)- XenApp","Citrix Systems Incorporated","www.citrixtraining.com"]
["CNCSI001","Mastercam Certified Programmer Mill Level 1 (CPgM1)","CNC Software Inc.","www.mastercamu.com"]
["CNCSI002","Mastercam Associate Certification - Mill Design and Toolpaths","CNC Software Inc.","www.mastercamu.com"]
["COMPT001","CompTIA A+","Computing Technology Industry Association (CompTIA)","www.comptia.org"]
["COMPT002","CompTIA CDIA+","Computing Technology Industry Association (CompTIA )","www.comptia.org"]
["COMPT005","CompTIA Linux+","Computing Technology Industry Association (CompTIA)","www.comptia.org"]
["COMPT006","CompTIA Network+","Computing Technology Industry Association (CompTIA)","www.comptia.org"]
["COMPT007","CompTIA Project+","Computing Technology Industry Association (CompTIA)","www.comptia.org"]
["COMPT008","CompTIA Security+","Computing Technology Industry Association (CompTIA)","www.comptia.org"]
["COMPT009","CompTIA Server+","Computing Technology Industry Association (CompTIA)","www.comptia.org"]
["COMPT014","CompTIA Cloud+","Computing Technology Industry Association (CompTIA)","www.comptia.org"]
["COMPT016","CompTIA Cybersecurity Analyst (CySA+)","Computing Technology Industry Association (CompTIA)","www.comptia.org"]
["COMPT017","CompTIA Advanced Security Practitioner (CASP)","Computing Technology Industry Association (CompTIA )","www.comptia.org"]
["COMPT018","CompTIA IT Fundamentals+","Computing Technology Industry Association (CompTIA)","www.comptia.org"]
["COMPT019","CompTIA PenTest+","Computing Technology Industry Association (CompTIA)","www.comptia.org"]
["CPREC001","Child Development Associate (CDA)","Council for Professional Recognition","www.cdacouncil.org/"]
["CPSTL001","Check Point Certified Security Administrator (CCSA)","Check Point Software Technologies Ltd.","www.checkpoint.com"]
["CPSTL002","Check Point Certified Security Expert (CCSE)","Check Point Software Technologies Ltd.","www.checkpoint.com"]
["CSCMP001","SCPro Fundamentals Bundle (8 exams)","Council of Supply Chain Management Professionals","cscmp.org"]
["CWNPT001","Certified Wireless Network Administrator (CWNA) ","CWNP","www.cwnp.com"]
["DANBD001","Certified Dental Assistant (CDA)","Dental Assisting National Board","www.dentalassisting.com"]
["DDSOA001","DSA Certified Professional Decorator","Designer/Decorator Society of America","www.dsasociety.com/"]
["DIGIT001","STARS GIS Technician","DigitalQuest, Inc.","www.digitalquest.com/"]
["EDTSO001","ParaPro Assessment","Educational Testing Service","www.ets.org/parapro"]
["EMCSQ001","Information Storage and Management (EMCISA) Associate","EMC","www.education.emc.com"]
["ENTCP001","ETCP Certified Entertainment Electrician","Entertainment Technician Certification Program (ETCP)","etcp.plasa.org"]
["ENTCP002","ETCP Certified Rigger – Arena","Entertainment Technician Certification Program (ETCP)","etcp.plasa.org"]
["ENTCP003","ETCP Certified Rigger – Theatre","Entertainment Technician Certification Program (ETCP)","etcp.plasa.org"]
["ESRIC001","ArcGIS Desktop Entry","ESRI","www.esri.com"]
["ETAIN002","Fiber Optics Installer (FOI)","Electronics Technician Association International","www.eta-i.org"]
["ETAIN008","Associate Certified Electronics Technician (CETa)","Electronics Technician Association International","www.eta-i.org"]
["ETAIN009","Data Cabling Installer Certification (DCIC)","Electronics Technician Association International","www.eta-i.org"]
["ETAIN010","Fiber Optics Technician (FOT)","Electronics Technician Association International","www.eta-i.org"]
["ETAIN011","Fiber Optics Technician-Outside Plant (FOT-OSP)","Electronics Technician Association International","www.eta-i.org"]
["ETAIN012","Photonics Technician - Operator (PTO)","Electronics Technician Association International","www.eta-i.org"]
["ETAIN013","Photonics Technician Specialist (PTS)","Electronics Technician Association International","www.eta-i.org"]
["ETAIN014","Photovoltaic Installer (PVI) - Level 1","Electronics Technician Association International","www.eta-i.org"]
["ETAIN019","Small Wind Installer (SWI) - Level 1","Electronics Technician Association International","www.eta-i.org"]
["ETAIN022","Specialist in Precision Optics (SPO)","Electronics Technician Association International","www.eta-i.org"]
["ETAIN023","Technician in Precision Optics (TPO)","Electronics Technician Association International","www.eta-i.org"]
["FASMB001","Massage & Bodywork Licensing Examination (MBLEx)","Federation of State Massage Therapy Boards","www.fsmtb.org/"]
["FDFCC001","Licensed Funeral Director","Florida Department of Financial Services, Division of Funeral, Cemetery & Consumer Services","www.fldfs.com/funeralcemetery/"]
["FDLIC004","Security Officer (Class D)","Florida Department of Agriculture and Consumer Services, Division of Licensing","licgweb.doacs.state.fl.us/"]
["FDMQA001","Basic X-Ray Machine Operator","Florida Department of Health","www.doh.state.fl.us/mqa/"]
["FDMQA002","Certified Nursing Assistant (CNA)","Florida Department of Health","www.doh.state.fl.us/mqa/"]
["FDMQA010","Licensed Dental Hygienist","Florida Department of Health","www.doh.state.fl.us/mqa/"]
["FDMQA014","Paramedic (EMT-P)","Florida Department of Health","www.doh.state.fl.us/mqa/"]
["FDMQA018","Licensed Physical Therapist Assistant","Florida Department of Health","www.doh.state.fl.us/mqa/"]
["FDMQA025","Licensed Optician","Florida Department of Health","www.doh.state.fl.us/mqa/"]
["FDMQA030","911 Public Safety Telecommunicator","Florida Department of Health","www.doh.state.fl.us/mqa/"]
["FDMQA031","Local Anesthesia for Dental Hygienists","Florida Department of Health","www.doh.state.fl.us/mqa/"]
["FEDAA001","FAA Air Traffic Control Specialist","Federal Aviation Administration","www.faa.gov/licenses_certificates/"]
["FEDAA002","FAA Aviation Maintenance Technician - General","Federal Aviation Administration","www.faa.gov/licenses_certificates/"]
["FEDAA004","FAA Aviation Mechanic Technician - Airframe","Federal Aviation Administration","www.faa.gov/licenses_certificates/"]
["FEDAA005","FAA Certified Flight Instructor License","Federal Aviation Administration","www.faa.gov/licenses_certificates/"]
["FEDAA006","FAA Commercial Pilot","Federal Aviation Administration","www.faa.gov/licenses_certificates/"]
["FEDAA010","FAA Aviation Maintenance Technician - Powerplant","Federal Aviation Administration","www.faa.gov/licenses_certificates/"]
["FEDAA011","FAA Private Pilot","Federal Aviation Administration","www.faa.gov/licenses_certificates/"]
["FEDAA013","FAA Ground School","Federal Aviation Administration","www.faa.gov/licenses_certificates/"]
["FEDCC001","FCC General Radiotelephone Operator License (PG)","Federal Communications Commission","wireless.fcc.gov/commoperators/pg.html"]
["FLADA001","Florida Automobile Dealers Association (FADA) Certified Technician","Florida Automobile Dealers Association","www.flada.org"]
["FLDAS002","License - Customer Representative (4-40)","Florida Department of Financial Services, Division of Agent and Agency Services","www.myfloridacfo.com/Agents/"]
["FLDAS003","License - General Lines Agent (2-20)","Florida Department of Financial Services, Division of Agent and Agency Services","www.myfloridacfo.com/Agents/"]
["FLDAS006","License - Life, Health and Annuities","Florida Department of Financial Services, Division of Agent and Agency Services","www.myfloridacfo.com/Agents/"]
["FLDCF001","Director Credential","Florida Department of Children and Families, Child Care Services","www.dcf.state.fl.us/childcare/"]
["FLDCF003","Florida Child Care Professional Credential","Florida Department of Children and Families, Child Care Services","www.dcf.state.fl.us/childcare/"]
["FLDCF005","Staff Credential","Florida Department of Children and Families, Child Care Services","www.dcf.state.fl.us/childcare/"]
["FLDCF006","VPK Director Credential","Florida Department of Children and Families, Child Care Services","www.dcf.state.fl.us/childcare/"]
["FLDDL001","Commercial Driver License (CDL)","Florida Department of Highway Safety and Motor Vehicles, Division of Driver Licenses","www.hsmv.state.fl.us/html/dlnew.html"]
["FLDEP001","Wastewater Treatment Plant Operator Level A","Florida Department of Environmental Protection","www.dep.state.fl.us/"]
["FLDEP002","Wastewater Treatment Plant Operator Level B","Florida Department of Environmental Protection","www.dep.state.fl.us/"]
["FLDEP003","Wastewater Treatment Plant Operator Level C","Florida Department of Environmental Protection","www.dep.state.fl.us/"]
["FLDEP004","Water Treatment Plant Operator Level A","Florida Department of Environmental Protection","www.dep.state.fl.us/"]
["FLDEP005","Water Treatment Plant Operator Level B","Florida Department of Environmental Protection","www.dep.state.fl.us/"]
["FLDEP006","Water Treatment Plant Operator Level C","Florida Department of Environmental Protection","www.dep.state.fl.us/"]
["FLDLE001","Auxiliary Law Enforcement Officer","Florida Department of Law Enforcement, Criminal Justice Standards and Training Commission","www.fdle.state.fl.us/cjst/commission/"]
["FLDLE002","Correctional Officer","Florida Department of Law Enforcement, Criminal Justice Standards and Training Commission","www.fdle.state.fl.us/cjst/commission/"]
["FLDLE003","Correctional Probation Officer","Florida Department of Law Enforcement, Criminal Justice Standards and Training Commission","www.fdle.state.fl.us/cjst/commission/"]
["FLDLE004","Law Enforcement Officer","Florida Department of Law Enforcement, Criminal Justice Standards and Training Commission","www.fdle.state.fl.us/cjst/commission/"]
["FLDOE001","Early Childhood Professional Certificate (ECPC)","Florida Department of Education","www.fldoe.org"]
["FLDOE002","School Age Professional Certificate (SAPC)","Florida Department of Education","www.fldoe.org"]
["FLDOP001","Barber","Florida Department of Business and Professional Regulation, Division of Professions","www.myfloridalicense.com/dbpr/pro/index.html"]
["FLDOP002","Cosmetologist","Florida Department of Business and Professional Regulation, Division of Professions","www.myfloridalicense.com/dbpr/pro/index.html"]
["FLDOP007","Restricted Barber","Florida Department of Business and Professional Regulation, Division of Professions","www.myfloridalicense.com/dbpr/pro/index.html"]
["FLDOP008","Nail Specialist","Florida Department of Business and Professional Regulation, Division of Professions","www.myfloridalicense.com/dbpr/pro/index.html"]
["FLDOP009","Facial Specialist","Florida Department of Business and Professional Regulation, Division of Professions","www.myfloridalicense.com/dbpr/pro/index.html"]
["FLDOT001","Maintenance of Traffic (MOT) Certification","Florida Department of Transportation","http://www.dot.state.fl.us/rddesign/MOT/MOT.SHTM"]
["FLFBR001","Agritechnology Specialist Certification","Agricultural Education Services and Technology Inc.","certify.ag/"]
["FLFBR005","Animal Science Specialist Certification","Agricultural Education Services and Technology Inc.","certify.ag/"]
["FLFBR007","Agriculture Associate Certification","Agricultural Education Services and Technology Inc.","certify.ag/"]
["FLSFM002","Certified Fire Fighter","Florida Department of Financial Services, State Fire Marshal, Bureau of Fire Standards & Training","www.myfloridacfo.com/Division/SFM/"]
["FLSFM005","Fire Fighter I","Florida Department of Financial Services, State Fire Marshal, Bureau of Fire Standards & Training","www.myfloridacfo.com/Division/SFM/"]
["FLSFM006","Fire Fighter II","Florida Department of Financial Services, State Fire Marshal, Bureau of Fire Standards & Training","www.myfloridacfo.com/Division/SFM/"]
["FLSFM007","Fire Safety Inspector I","Florida Department of Financial Services, State Fire Marshal, Bureau of Fire Standards & Training","www.myfloridacfo.com/Division/SFM/"]
["FLSFM013","Fire Officer I","Florida Department of Financial Services, State Fire Marshal, Bureau of Fire Standards & Training","www.myfloridacfo.com/Division/SFM/"]
["FLSFM014","Fire Officer II","Florida Department of Financial Services, State Fire Marshal, Bureau of Fire Standards & Training","www.myfloridacfo.com/Division/SFM/"]
["FLSFM016","Fire Safety Inspector","Florida Department of Financial Services, State Fire Marshal, Bureau of Fire Standards & Training","www.myfloridacfo.com/Division/SFM/"]
["FLSFM018","Fire Instructor I","Florida Department of Financial Services, State Fire Marshal, Bureau of Fire Standards & Training","www.myfloridacfo.com/Division/SFM/"]
["FLVMA002","Certified Veterinary Assistant (CVA)","Florida Veterinary Medical Association","www.fvma.com/"]
["FMAIN001","Precision Sheetmetal Operator - Level I (PSMO)","Fabricators & Manufacturers Association, International (FMA)","www.fmanet.org"]
["FNGLA001","Certified Horticulture Professional","Florida Nursery Growers and Landscape Association","www.fngla.org/"]
["FNGLA002","Certified Landscape Contractor","Florida Nursery Growers and Landscape Association","www.fngla.org/"]
["FNGLA003","Certified Landscape Designer","Florida Nursery Growers and Landscape Association","www.fngla.org/"]
["FNGLA004","Certified Landscape Technician","Florida Nursery Growers and Landscape Association","www.fngla.org/"]
["FPARA001","Certified Florida Paralegal","Paralegal Association of Florida","www.pafinc.org/"]
["GLIAC001","GIAC Certified Forensic Analyst (GCFA)","Global Information Assurance Certification","www.giac.org"]
["GLIAC002","GIAC Certified Forensic Examiner (GCFE)","Global Information Assurance Certification","www.giac.org"]
["GLIAC003","GIAC Certified UNIX Security Administrator (GCUX)","Global Information Assurance Certification","www.giac.org"]
["GLIAC004","GIAC Information Security Fundamentals (GISF)","Global Information Assurance Certification","www.giac.org"]
["GLIAC005","GIAC Security Essentials (GSEC)","Global Information Assurance Certification","www.giac.org"]
["GRBCI002","LEED Green Associate","Green Building Certification Institute","www.gbci.org"]
["GRBI1002","LEED Green Associate","US Green Building Council (USGBC)","www.usgbc.org"]
["HBINS003","HBI Pre-Apprenticeship Certificate Training (PACT), Carpentry","Home Builders Institute","http://www.hbi.org/"]
["HBINS004","HBI Pre-Apprenticeship Certificate Training (PACT), Core","Home Builders Institute","http://www.hbi.org/"]
["HBINS005","HBI Pre-Apprenticeship Certificate Training (PACT), Core Green","Home Builders Institute","http://www.hbi.org/"]
["HBINS006","HBI Pre-Apprenticeship Certificate Training (PACT), Electrical","Home Builders Institute","http://www.hbi.org/"]
["HIMSS001","Certified Associate in Healthcare Information & Management Systems","Certified Associate in Healthcare Information & Management Systems","www.himss.org"]
["HVACE001","HVAC Excellence Employment Ready - Heat Pump","HVAC Excellence","www.hvacexcellence.org"]
["HVACE002","HVAC Excellence EmploymentReady - Air Conditioning","HVAC Excellence","www.hvacexcellence.org"]
["HVACE003","HVAC Excellence Employment Ready - Light Commercial Air Conditioning","HVAC Excellence","www.hvacexcellence.org"]
["HVACE004","HVAC Excellence Employment Ready - Electric Heat","HVAC Excellence","www.hvacexcellence.org"]
["HVACE005","HVAC Excellence Employment Ready - Light Commercial Refrigeration","HVAC Excellence","www.hvacexcellence.org"]
["HVACE006","HVAC Excellence Employment Ready - Gas Heat","HVAC Excellence","www.hvacexcellence.org"]
["HVACE011","HVAC Excellence Employment Ready - Electrical","HVAC Excellence","www.hvacexcellence.org"]
["IACRB001","Certified Computer Forensics Examiner (CCFE)","Information Assurance Certification Review Board","www.iacertification.org"]
["IASSC001","IASSC Certified Black Belt","International Association For Six Sigma Certification","www.iassc.org"]
["ICOEC002","Certified Ethical Hacker (CEH)","EC-Council","www.eccouncil.org/"]
["ICOEC003","Computer Hacking Forensic Investigator (CHFI)","EC-Council","www.eccouncil.org/"]
["ICOEC004","Certified Security Analyst (ECSA)","EC-Council","www.eccouncil.org/"]
["ICOEC005","EC-Council Cyber Forensics Associate","EC-Council","www.eccouncil.org"]
["ICOEC006","EC-Council Ethical Hacker Associate","EC-Council","www.eccouncil.org"]
["IECON001","Field Service Engineer - Low Voltage Systems","Independent Electrical Contractors","www.iecfwcc.org"]
["IECON002","Field Service Engineer - Voice-Data-Video","Independent Electrical Contractors","www.iecfwcc.org"]
["IECON003","Journeyman Electrician","Independent Electrical Contractors","www.iecfwcc.org"]
["IECON004","Residential Wireman","Independent Electrical Contractors","www.iecfwcc.org"]
["IGCEM001","Certified Assistant Turf Equipment Technician","International Golf Course Equipment Managers Association","www.igcema.org"]
["IHKBZ001","CNC Production Specialist","IHK-Bildungszentrum","www.machiningtrainingsolutions.com/IHK.html"]
["IHKBZ002","Electronics Technician for Industrial Engineering","IHK-Bildungszentrum","www.machiningtrainingsolutions.com/IHK.html"]
["IHKBZ004","Mechatronics Fitter","IHK-Bildungszentrum","www.machiningtrainingsolutions.com/IHK.html"]
["IHKBZ005","Precision Machinist","IHK-Bildungszentrum","www.machiningtrainingsolutions.com/IHK.html"]
["IISSC001","CISSP- Information Systems Security Management Professional (CISSP-ISSMP)","International Information Systems Security Certification Consortium, Inc.","www.isc2.org"]
["IISSC002","Systems Security Certified Practitioner (SSCP)","International Information Systems Security Certification Consortium, Inc.","www.isc2.org"]
["IISSC003","Certified Cyber Forensics Professional (CCFP)","International Information Systems Security Certification Consortium, Inc.","www.isc2.org"]
["IISSC004","Certified Information Systems Security Professional (CISSP)","International Information Systems Security Certification Consortium, Inc.","www.isc2.org"]
["INSOC002","Certified Automation Professional (CAP)","International Society of Automation","www.isa.org"]
["INSOC005","Certified Control Systems Technician (CCST) - Level 3","International Society of Automation","www.isa.org"]
["INTUT001","Quickbooks Certified User","Intuit","www.intuit.com"]
["IOEEE002","Certified Software Development Associate (CSDA)","IEEE Computer Society","www.computer.org"]
["ISCET001","Associate Level Certified Electronic Technician","International Society for Certified Electronics Technicians","www.iscet.org/"]
["ISCET002","Electronics System Associate (ESA)","International Society for Certified Electronics Technicians","www.iscet.org/"]
["JCAHO001","Certified Ophthalmic Medical Technologist (COMT)","Joint Commission on Allied Health Personnel in Ophthalmology (JCAHPO)","www.jcahpo.org/certification/"]
["JCAHO002","Certified Ophthalmic Technician (COT)","Joint Commission on Allied Health Personnel in Ophthalmology (JCAHPO)","www.jcahpo.org/certification/"]
["LINPI001","Linux Essentials 010","Linux Professional Institute","www.lpi.org"]
["MANSI001","Manufacturing Technician 1 (MT1)","Manufacturing Skills Institute (MSI)","manufacturingskillsinstitute.org"]
["MICRO017","Microsoft Office Specialist Master","Microsoft Corporation","www.microsoft.com/learning/en/us/default.aspx"]
["MICRO052","Microsoft Certified Trainer (MCT)","Microsoft Corporation","www.microsoft.com/learning/en/us/default.aspx"]
["MICRO069","Microsoft Office Specialist (MOS) Bundle Certification (3 of 6)","Microsoft Corporation","www.microsoft.com/learning/en/us/default.aspx"]
["MICRO070","Microsoft Technology Associate (MTA) - Database Administration Fundamentals","Microsoft Corporation","www.microsoft.com/learning/en/us/default.aspx"]
["MICRO074","Microsoft Technology Associate (MTA) - Software Development Fundamentals","Microsoft Corporation","www.microsoft.com/learning/en/us/default.aspx"]
["MICRO076","Microsoft Technology Associate (MTA) - Windows OS Fundamentals","Microsoft Corporation","www.microsoft.com/learning/en/us/default.aspx"]
["MICRO077","Microsoft Technology Associate (MTA) - Security Fundamentals","Microsoft Corporation","www.microsoft.com/learning/en/us/default.aspx"]
["MICRO078","Microsoft Technology Associate (MTA) - Networking Fundamentals","Microsoft Corporation","www.microsoft.com/learning/en/us/default.aspx"]
["MICRO080","Microsoft Technology Associate (MTA) - HTML5 Application Developer Fundamentals","Microsoft Corporation","www.microsoft.com/learning/en/us/default.aspx"]
["MICRO082","Microsoft Certified Solutions Associate (MCSA) - SQL Server 2012","Microsoft Corporation","www.microsoft.com/learning/en/us/default.aspx"]
["MICRO085","Microsoft Certified Solutions Associate (MCSA) - Windows Server 2008","Microsoft Corporation","www.microsoft.com/learning/en/us/default.aspx"]
["MICRO086","Microsoft Certified Solutions Associate (MCSA) - Windows Server 2012","Microsoft Corporation","www.microsoft.com/learning/en/us/default.aspx"]
["MICRO089","Microsoft Certified Solutions Expert (MCSE) - Data Platform","Microsoft Corporation","www.microsoft.com/learning/en/us/default.aspx"]
["MICRO101","Microsoft Technology Associate (MTA) - Software Testing Fundamentals","Microsoft Corporation","www.microsoft.com/learning/en/us/default.aspx"]
["MICRO102","Microsoft Technology Associate (MTA) - Mobility and Devices Fundamentals","Microsoft Corporation","www.microsoft.com/learning/en/us/default.aspx"]
["MICRO103","Microsoft Technology Associate (MTA) - Intro Programming Using Block-Based Languages","Microsoft Corporation","www.microsoft.com/learning/en/us/default.aspx"]
["MICRO106","Microsoft Certified Solutions Associate (MCSA) - Windows Server 2016","Microsoft Corporation","www.microsoft.com/learning/en/us/default.aspx"]
["MICRO107","Microsoft Certified Solutions Expert (MCSE) - Data Management and Analytics","Microsoft Corporation","www.microsoft.com/learning/en/us/default.aspx"]
["MICRO108","Microsoft Certified Solutions Expert (MCSE) - Productivity","Microsoft Corporation","www.microsoft.com/learning/en/us/default.aspx"]
["MICRO109","Microsoft Certified Solutions Expert (MCSE) - Cloud Platform and Infrastructure","Microsoft Corporation","www.microsoft.com/learning/en/us/default.aspx"]
["MICRO110","Microsoft Certified Solutions Expert (MCSE) - Mobility","Microsoft Corporation","www.microsoft.com/learning/en/us/default.aspx"]
["MICRO111","Microsoft Certified Solutions Developer (MCSD) - App Builder","Microsoft Corporation","www.microsoft.com/learning/en/us/default.aspx"]
["MICRO112","Microsoft Technology Associate (MTA) - Introduction to Programming Using Python","Microsoft Corporation","www.microsoft.com/learning/en/us/default.aspx"]
["MICRO113","Microsoft Technology Associate (MTA) - Cloud Fundamentals","Microsoft Corporation","www.microsoft.com/learning/en/us/default.aspx"]
["MICRO114","Microsoft Technology Associate (MTA) - Introduction to Programming Using Java","Microsoft Corporation","www.microsoft.com/learning/en/us/default.aspx"]
["MICRO115","Microsoft Technology Associate (MTA) - Windows Server Administration Fundamentals","Microsoft Corporation","www.microsoft.com/learning/en/us/default.aspx"]
["MSSCN001","MSSC Certified Production Technician (CPT)","Manufacturing Skills Standards Council (MSSC)","www.msscusa.org/"]
["MSSCN002","MSSC Certified Logistics Technician (CLT)","Manufacturing Skills Standards Council (MSSC)","www.msscusa.org/"]
["NACFS001","Modeling & Simulation (M&S) Certification","National Center for Simulation","www.simulationinformation.com/modeling-and-simulation-certification"]
["NAHUC001","Certified Health Unit Coordinator (CHUC)","National Association of Health Unit Coordinators, Inc.","www.nahuc.org/"]
["NASME001","NASM Certified Personal Trainer (CPT)","National Academy of Sports Medicine","www.nasm.org/"]
["NATEX001","Air Conditioning Service Technician","North American Technician Excellence","www.natex.org/technicians/certification-basics101/"]
["NATEX002","Air Conditioning Installation Specialization","North American Technician Excellence","www.natex.org/technicians/certification-basics101/"]
["NATEX003","Air to Air Heat Pump Installation Technician","North American Technician Excellence","www.natex.org/technicians/certification-basics101/"]
["NATEX004","Air to Air Heat Pump Service Technician","North American Technician Excellence","www.natex.org/technicians/certification-basics101/"]
["NATEX006","NATEX Industry Competency Exam (ICE) - Light Commercial","North American Technician Excellence","www.natex.org/technicians/certification-basics101/"]
["NATHA002","Certified EKG Technician (CET)","National Healthcareer Association","www.nhanow.com"]
["NATHA003","Certified Medical Administrative Assistant (CMAA)","National Healthcareer Association","www.nhanow.com"]
["NATHA006","Certified Patient Care Technician (CPCT)","National Healthcareer Association","www.nhanow.com"]
["NATHA007","Certified Phlebotomy Technician (CPT)","National Healthcareer Association","www.nhanow.com"]
["NATHA008","Certified Billing & Coding Specialist (CBCS)","National Healthcareer Association","www.nhanow.com"]
["NATHA009","Certified Clinical Medical Assistant (CCMA)","National Healthcareer Association","www.nhanow.com"]
["NATHA010","Certified Pharmacy Technician (CPhT)","National Healthcareer Association","www.nhanow.com"]
["NATHA011","Certified Electronic Health Record Specialist (CEHRS)","National Healthcareer Association","www.nhanow.com"]
["NBCHT001","Colon Hydrotherapy Certification Exam","National Board for Colon Hydrotherapy","www.nbcht.org"]
["NBCOT001","Orthopaedic Technologist Certified (OTC)","National Board for Certification of Orthopaedic Technologists","www.nbcot.net"]
["NBFOT001","Certified Occupational Therapy Assistant","National Board for Certification in Occupational Therapy","www.nbcot.org"]
["NBFRC001","Certified Respiratory Therapist (CRT)","National Board for Respiratory Care","www.nbrc.org"]
["NBFRC002","Registered Respiratory Therapist (RRT)","National Board for Respiratory Care","www.nbrc.org"]
["NBTMB001","Certified Massage Therapist","National Certification Board of Therapeutic Massage and Bodywork","www.ncbtmb.com/"]
["NCATT001","Aircraft Electronics Technician (AET) ","National Center for Aerospace and Transportation Technologies (NCATT)","www.ncatt.org"]
["NCATT003","Aerospace / Aircraft Assembly (AAA)","National Center for Aerospace and Transportation Technologies (NCATT)","www.ncatt.org"]
["NCCER008","NCCER Construction Technology (Secondary)","National Center for Construction Education & Research (NCCER)","www.nccer.org"]
["NCCER018","NCCER HVAC - Level 1 (Secondary)","National Center for Construction Education & Research (NCCER)","www.nccer.org"]
["NCCER098","NCCER Manufactured Construction Technology - Level 1 (Secondary)","National Center for Construction Education & Research (NCCER)","www.nccer.org"]
["NCCER099","NCCER Manufactured Construction Technology - Level 2 (Secondary)","National Center for Construction Education & Research (NCCER)","www.nccer.org"]
["NCCER201","NCCER Carpentry - Level 1 (Postsecondary)","National Center for Construction Education & Research (NCCER)","www.nccer.org"]
["NCCER202","NCCER Carpentry - Level 2 (Postsecondary)","National Center for Construction Education & Research (NCCER)","www.nccer.org"]
["NCCER203","NCCER Carpentry - Level 3 (Postsecondary)","National Center for Construction Education & Research (NCCER)","www.nccer.org"]
["NCCER204","NCCER Carpentry - Level 4 (Postsecondary)","National Center for Construction Education & Research (NCCER)","www.nccer.org"]
["NCCER205","NCCER Concrete Finishing - Level 1 (Postsecondary)","National Center for Construction Education & Research (NCCER)","www.nccer.org"]
["NCCER206","NCCER Concrete Finishing - Level 2 (Postsecondary)","National Center for Construction Education & Research (NCCER)","www.nccer.org"]
["NCCER207","NCCER Construction Technology (Postsecondary)","National Center for Construction Education & Research (NCCER)","www.nccer.org"]
["NCCER208","NCCER Electrical - Level 1 (Postsecondary)","National Center for Construction Education & Research (NCCER)","www.nccer.org"]
["NCCER209","NCCER Electrical - Level 2 (Postsecondary)","National Center for Construction Education & Research (NCCER)","www.nccer.org"]
["NCCER210","NCCER Electrical - Level 3 (Postsecondary)","National Center for Construction Education & Research (NCCER)","www.nccer.org"]
["NCCER211","NCCER Electrical - Level 4 (Postsecondary)","National Center for Construction Education & Research (NCCER)","www.nccer.org"]
["NCCER212","NCCER Electronic Systems Technician - Level 1 (Postsecondary)","National Center for Construction Education & Research (NCCER)","www.nccer.org"]
["NCCER213","NCCER Electronic Systems Technician - Level 2 (Postsecondary)","National Center for Construction Education & Research (NCCER)","www.nccer.org"]
["NCCER214","NCCER Electronic Systems Technician - Level 3 (Postsecondary)","National Center for Construction Education & Research (NCCER)","www.nccer.org"]
["NCCER215","NCCER Electronic Systems Technician - Level 4 (Postsecondary)","National Center for Construction Education & Research (NCCER)","www.nccer.org"]
["NCCER216","NCCER Heavy Equipment Operations - Level 1 (Postsecondary)","National Center for Construction Education & Research (NCCER)","www.nccer.org"]
["NCCER217","NCCER Heavy Equipment Operations - Level 2 (Postsecondary)","National Center for Construction Education & Research (NCCER)","www.nccer.org"]
["NCCER218","NCCER Heavy Equipment Operations - Level 3 (Postsecondary)","National Center for Construction Education & Research (NCCER)","www.nccer.org"]
["NCCER219","NCCER HVAC - Level 1 (Postsecondary)","National Center for Construction Education & Research (NCCER)","www.nccer.org"]
["NCCER220","NCCER HVAC - Level 2 (Postsecondary)","National Center for Construction Education & Research (NCCER)","www.nccer.org"]
["NCCER221","NCCER HVAC - Level 3 (Postsecondary)","National Center for Construction Education & Research (NCCER)","www.nccer.org"]
["NCCER222","NCCER HVAC - Level 4 (Postsecondary)","National Center for Construction Education & Research (NCCER)","www.nccer.org"]
["NCCER223","NCCER Industrial Maintenance Mechanic - Level 1 (Postsecondary)","National Center for Construction Education & Research (NCCER)","www.nccer.org"]
["NCCER224","NCCER Industrial Maintenance Mechanic - Level 2 (Postsecondary)","National Center for Construction Education & Research (NCCER)","www.nccer.org"]
["NCCER225","NCCER Industrial Maintenance Mechanic - Level 3 (Postsecondary)","National Center for Construction Education & Research (NCCER)","www.nccer.org"]
["NCCER231","NCCER Insulating - Level 3 (Postsecondary)","National Center for Construction Education & Research (NCCER)","www.nccer.org"]
["NCCER234","NCCER Ironworking - Level 3 (Postsecondary)","National Center for Construction Education & Research (NCCER)","www.nccer.org"]
["NCCER235","NCCER Masonry - Level 1 (Postsecondary)","National Center for Construction Education & Research (NCCER)","www.nccer.org"]
["NCCER236","NCCER Masonry - Level 2 (Postsecondary)","National Center for Construction Education & Research (NCCER)","www.nccer.org"]
["NCCER237","NCCER Masonry - Level 3 (Postsecondary)","National Center for Construction Education & Research (NCCER)","www.nccer.org"]
["NCCER238","NCCER Millwright - Level 1 (Postsecondary)","National Center for Construction Education & Research (NCCER)","www.nccer.org"]
["NCCER239","NCCER Millwright - Level 2 (Postsecondary)","National Center for Construction Education & Research (NCCER)","www.nccer.org"]
["NCCER240","NCCER Millwright - Level 3 (Postsecondary)","National Center for Construction Education & Research (NCCER)","www.nccer.org"]
["NCCER241","NCCER Millwright - Level 4 (Postsecondary)","National Center for Construction Education & Research (NCCER)","www.nccer.org"]
["NCCER242","NCCER Millwright - Level 5 (Postsecondary)","National Center for Construction Education & Research (NCCER)","www.nccer.org"]
["NCCER243","NCCER Painting - Level 1 (Postsecondary)","National Center for Construction Education & Research (NCCER)","www.nccer.org"]
["NCCER244","NCCER Painting - Level 2 (Postsecondary)","National Center for Construction Education & Research (NCCER)","www.nccer.org"]
["NCCER245","NCCER Painting - Level 3 (Postsecondary)","National Center for Construction Education & Research (NCCER)","www.nccer.org"]
["NCCER249","NCCER Pipefitting - Level 4 (Postsecondary)","National Center for Construction Education & Research (NCCER)","www.nccer.org"]
["NCCER250","NCCER Plumbing - Level 1 (Postsecondary)","National Center for Construction Education & Research (NCCER)","www.nccer.org"]
["NCCER251","NCCER Plumbing - Level 2 (Postsecondary)","National Center for Construction Education & Research (NCCER)","www.nccer.org"]
["NCCER252","NCCER Plumbing - Level 3 (Postsecondary)","National Center for Construction Education & Research (NCCER)","www.nccer.org"]
["NCCER253","NCCER Plumbing - Level 4 (Postsecondary)","National Center for Construction Education & Research (NCCER)","www.nccer.org"]
["NCCER254","NCCER Project Management (Postsecondary)","National Center for Construction Education & Research (NCCER)","www.nccer.org"]
["NCCER255","NCCER Sheet Metal - Level 1 (Postsecondary)","National Center for Construction Education & Research (NCCER)","www.nccer.org"]
["NCCER258","NCCER Sheet Metal - Level 4 (Postsecondary)","National Center for Construction Education & Research (NCCER)","www.nccer.org"]
["NCCER262","NCCER Sprinkler Fitting Level 4 (Postsecondary)","National Center for Construction Education & Research (NCCER)","www.nccer.org"]
["NCCER263","NCCER Welding - Level 1 (Postsecondary)","National Center for Construction Education & Research (NCCER)","www.nccer.org"]
["NCCER264","NCCER Welding - Level 2 (Postsecondary)","National Center for Construction Education & Research (NCCER)","www.nccer.org"]
["NCCER265","NCCER Welding - Level 3 (Postsecondary)","National Center for Construction Education & Research (NCCER)","www.nccer.org"]
["NCCER266","NCCER Industrial Maintenance Mechanic - Level 4 (Postsecondary)","National Center for Construction Education & Research (NCCER)","www.nccer.org"]
["NCCER267","NCCER Industrial Maintenance, Electrical & Instrumentation Technician - Level 4 (Postsecondary)","National Center for Construction Education & Research (NCCER)","www.nccer.org"]
["NCDLT001","Certified Dental Technician","National Board for Certification in Dental Laboratory Technology","www.nbccert.org/"]
["NCFCT001","Certified ECG Technician","National Center for Competency Testing","www.ncctinc.com"]
["NCFCT003","Certified Phlebotomy Technician","National Center for Competency Testing","www.ncctinc.com"]
["NCFCT004","Tech in Surgery - Certified (NCCT)","National Center for Competency Testing","www.ncctinc.com"]
["NCFCT005","Medical Assistant","National Center for Competency Testing","www.ncctinc.com"]
["NCFCT006","National Certified Insurance and Coding Specialist (NCICS)","National Center for Competency Testing (NCCT)","www.ncctinc.com"]
["NCFCT007","National Certified Medical Office Assistant (NCMOA)","National Center for Competency Testing (NCCT)","www.ncctinc.com"]
["NCFCT008","National Certified Patient Care Technician (NCPCT)","National Center for Competency Testing (NCCT)","www.ncctinc.com"]
["NCMCA001","Certified Board for Sterile Processing and Distribution","National Commission for Certifying Agencies","www.sterileprocessing.org/technician.htm"]
["NCRAS001","Certified Broadcast Captioner","National Court Reporters Association","www.ncra.org/"]
["NCRAS003","Professional Reporter","National Court Reporters Association","www.ncra.org/"]
["NCSAF001","Certified Strength Coach","National Council on Strength and Fitness (NCSF)","www.ncsf.org"]
["NCSAF002","Certified Personal Trainer","National Council on Strength and Fitness (NCSF)","www.ncsf.org"]
["NCSAF003","Sport Nutrition Specialist","National Council on Strength and Fitness (NCSF)","www.ncsf.org"]
["NCSBN001","National Licensed Registered Nurse (NCLEX-RN)","National Council of State Boards of Nursing","www.ncsbn.org/"]
["NCSBN002","National Licensed Practical Nurse (NCLEX-PN)","National Council of State Boards of Nursing","www.ncsbn.org/"]
["NIASE001","ASE - Advanced Engine Performance Specialist (L1)","National Institute for Automotive Service Excellence","www.ase.com"]
["NIASE002","ASE Master Automobile Technician","National Institute for Automotive Service Excellence","www.ase.com"]
["NIASE005","ASE Automobile/Light Truck Technician: Automatic Transmission/Transaxle (A2)","National Institute for Automotive Service Excellence","www.ase.com"]
["NIASE007","ASE Automobile/Light Truck Technician: Brakes (A5)","National Institute for Automotive Service Excellence","www.ase.com"]
["NIASE008","ASE Automobile/Light Truck Technician: Electrical/Electronic Systems (A6)","National Institute for Automotive Service Excellence","www.ase.com"]
["NIASE009","ASE Automobile/Light Truck Technician: Engine Performance (A8)","National Institute for Automotive Service Excellence","www.ase.com"]
["NIASE010","ASE Automobile/Light Truck Technician: Engine Repair (A1)","National Institute for Automotive Service Excellence","www.ase.com"]
["NIASE011","ASE Automobile/Light Truck Technician: Heating and Air Conditioning (A7)","National Institute for Automotive Service Excellence","www.ase.com"]
["NIASE012","ASE Automobile/Light Truck Technician: Manual Drive Train and Axles (A3)","National Institute for Automotive Service Excellence","www.ase.com"]
["NIASE013","ASE Automobile Service Consultant (C1)","National Institute for Automotive Service Excellence","www.ase.com"]
["NIASE014","ASE Automobile/Light Truck Technician: Suspension and Steering (A4)","National Institute for Automotive Service Excellence","www.ase.com"]
["NIASE016","ASE Medium/Heavy Truck Technician: Brakes (T4)","National Institute for Automotive Service Excellence","www.ase.com"]
["NIASE017","ASE Collision Repair and Refinishing Technician: Mechanical and Electrical Components (B5)","National Institute for Automotive Service Excellence","www.ase.com"]
["NIASE018","ASE Collision Repair and Refinishing Technician: Non-structural Analysis and Damage Repair (B3)","National Institute for Automotive Service Excellence","www.ase.com"]
["NIASE019","ASE - Damage Analysis and Estimating (B6)","National Institute for Automotive Service Excellence","www.ase.com"]
["NIASE020","ASE Medium/Heavy Truck Technician: Diesel Engines (T2)","National Institute for Automotive Service Excellence","www.ase.com"]
["NIASE021","ASE Medium/Heavy Truck Technician: Drive Train (T3)","National Institute for Automotive Service Excellence","www.ase.com"]
["NIASE023","ASE Medium/Heavy Truck Technician: Electrical/Electronic Systems (T6)","National Institute for Automotive Service Excellence","www.ase.com"]
["NIASE025","ASE - Gasoline Engines (T1)","National Institute for Automotive Service Excellence","www.ase.com"]
["NIASE026","ASE Medium/Heavy Truck Technician: Heating, Ventilation, and A/C (HVAC) (T7)","National Institute for Automotive Service Excellence","www.ase.com"]
["NIASE029","ASE Collision Repair and Refinishing Technician: Painting and Refinishing (B2)","National Institute for Automotive Service Excellence","www.ase.com"]
["NIASE031","ASE Medium/Heavy Truck Technician: Preventive Maintenance Inspection (PMI) (T8)","National Institute for Automotive Service Excellence","www.ase.com"]
["NIASE032","ASE Collision Repair and Refinishing Technician: Structural Analysis and Damage Repair (B4)","National Institute for Automotive Service Excellence","www.ase.com"]
["NIASE033","ASE Medium/Heavy Truck Technician: Suspension and Steering (T5)","National Institute for Automotive Service Excellence","www.ase.com"]
["NIASE035","ASE Master Collision Repair and Refinishing Technician","National Institute for Automotive Service Excellence","www.ase.com"]
["NIASE053","ASE - Compressed Natural Gas (CNG) Engines (H1)","National Institute for Automotive Service Excellence","www.ase.com"]
["NIASE054","ASE - Diesel Engines (H2)","National Institute for Automotive Service Excellence","www.ase.com"]
["NIASE055","ASE - Drive Train (H3)","National Institute for Automotive Service Excellence","www.ase.com"]
["NIASE056","ASE - Brakes (H4)","National Institute for Automotive Service Excellence","www.ase.com"]
["NIASE057","ASE - Suspension and Steering (H5)","National Institute for Automotive Service Excellence","www.ase.com"]
["NIASE058","ASE - Electrical/Electronic Systems (H6)","National Institute for Automotive Service Excellence","www.ase.com"]
["NIASE059","ASE - Heating Ventilation and Air Conditioning (HVAC) (H7)","National Institute for Automotive Service Excellence","www.ase.com"]
["NIASE060","ASE - Preventive Maintenance and Inspection (PMI) (H8)","National Institute for Automotive Service Excellence","www.ase.com"]
["NIASE061","ASE - Alternate Fuels (F1)","National Institute for Automotive Service Excellence","www.ase.com"]
["NIASE071","ASE - Light Vehicle Diesel Engines (A9)","National Institute for Automotive Service Excellence","www.ase.com"]
["NIASE076","ASE Auto Maintenance and Light Repair (G1)","National Institute for Automotive Service Excellence","www.ase.com"]
["NIASE094","ASE Entry-level - Truck: Inspection, Maintenance, and Minor Repair (IM)","National Institute for Automotive Service Excellence","www.ase.com"]
["NIFMS001","NIMS Machining Level I - CNC Milling: Programming Setup & Operations","National Institute for Metalworking Skills (NIMS)","www.nims-skills.org"]
["NIFMS002","NIMS Machining Level I - CNC Turning: Programming Setup & Operations","National Institute for Metalworking Skills (NIMS)","www.nims-skills.org"]
["NIFMS003","NIMS Machining Level II - EDM - Plunge","National Institute for Metalworking Skills (NIMS)","www.nims-skills.org"]
["NIFMS004","NIMS Machining Level II - EDM - Wire","National Institute for Metalworking Skills (NIMS)","www.nims-skills.org"]
["NIFMS007","NIMS Machining Level II - Manual Milling Skills II","National Institute for Metalworking Skills (NIMS)","www.nims-skills.org"]
["NIFMS008","NIMS Machining Level I - Turning Operations: Turning Between Centers","National Institute for Metalworking Skills (NIMS)","www.nims-skills.org"]
["NIFMS010","NIMS Machining Level I - Turning Operations: Turning Chucking Skills","National Institute for Metalworking Skills (NIMS)","www.nims-skills.org"]
["NIFMS012","NIMS Machining Level II - Grinding Skills II","National Institute for Metalworking Skills (NIMS)","www.nims-skills.org"]
["NIFMS013","NIMS Machining Level I - Drill Press Skills I","National Institute for Metalworking Skills (NIMS)","www.nims-skills.org"]
["NIFMS014","NIMS Machining Level I - CNC Milling: Operations","National Institute for Metalworking Skills (NIMS)","www.nims-skills.org"]
["NIFMS015","NIMS Machining Level I - CNC Turning: Operations","National Institute for Metalworking Skills (NIMS)","www.nims-skills.org"]
["NIFMS016","NIMS Machining Level I - Grinding Skills I","National Institute for Metalworking Skills (NIMS)","www.nims-skills.org"]
["NIFMS017","NIMS Machining Level I - Manual Milling Skills I","National Institute for Metalworking Skills (NIMS)","www.nims-skills.org"]
["NIFMS018","NIMS Machining Level II - Drill Press Skills II","National Institute for Metalworking Skills (NIMS)","www.nims-skills.org"]
["NIFMS019","NIMS Machining Level II - CNC Milling Skills II","National Institute for Metalworking Skills (NIMS)","www.nims-skills.org"]
["NIFMS020","NIMS Machining Level II - CNC Turning Skills II","National Institute for Metalworking Skills (NIMS)","www.nims-skills.org"]
["NIFMS021","NIMS Industrial Technology Maintenance Level 1 Bundle (9 Exams)","National Institute for Metalworking Skills","www.nims-skills.org"]
["NJATC001","NJATC Electrical - Level 5","National Joint Apprenticeship and Training Committee","www.njatc.org"]
["NMTCB001","Certified Nuclear Medicine Technologist","Nuclear Medicine Technology Certification Board","www.nmtcb.org/"]
["NMTCB002","Computed Tomography (CT)","Nuclear Medicine Technology Certification Board","www.nmtcb.org/"]
["NNCCO001","Certified Clinical Hemodialysis Technician","Nephrology Nursing Certification Commission","www.nncc-exam.org/"]
["NOCTI003","NOCTI Apparel and Textile Production and Merchandising","National Occupational Competency Testing Institute (NOCTI)","www.nocti.org/"]
["NOCTI010","NOCTI Criminal Justice","National Occupational Competency Testing Institute (NOCTI)","www.nocti.org/"]
["NOCTI013","NOCTI Television Production","National Occupational Competency Testing Institute (NOCTI)","www.nocti.org/"]
["NOCTI015","NOCTI Accounting Basic","National Occupational Competency Testing Institute (NOCTI)","www.nocti.org/"]
["NOCTI019","NOCTI Cabinetmaking","National Occupational Competency Testing Institute (NOCTI)","www.nocti.org/"]
["NRAEF001","Foodservice Management Professional (FMP)","National Restaurant Association Educational Foundation","www.nraef.org"]
["NRAEF002","National ProStart Certificate of Achievement","National Restaurant Association Educational Foundation","www.nraef.org"]
["NRAEF003","Certified Food Protection Manager (ServSafe®)","National Restaurant Association Educational Foundation","www.nraef.org"]
["NREMT001","Emergency Medical Technician (EMT)","National Registry of Emergency Medical Technicians","www.nremt.org"]
["NREMT004","Paramedic (EMT-P)","National Registry of Emergency Medical Technicians","www.nremt.org"]
["NRFSP001","Certified Food Safety Manager","National Registry of Food Safety Professionals","www.nrfsp.com/"]
["NRFSP002","HACCP Certification","National Registry of Food Safety Professionals","www.nrfsp.com/"]
["NSTSA001","Certified Surgical Technologist (CST)","National Board of Surgical Technologist and Surgical Assisting","nbstsa.org/"]
["NSTSA002","Certified Surgical First Assistant (CSFA)","National Board of Surgical Technologist and Surgical Assisting","nbstsa.org/"]
["ORACL001","Oracle Certified Associate (OCA): Database","Oracle Corporation","www.oracle.com"]
["ORACL002","Oracle Certified Professional (OCP): Database","Oracle Corporation","www.oracle.com"]
["ORACL003","Oracle Certified Master (OCM): Database","Oracle Corporation","www.oracle.com"]
["ORACL004","Oracle Certified Associate (OCA): Java Programmer","Oracle Corporation","www.oracle.com"]
["ORACL005","Oracle Certified Professional (OCP): Java Programmer","Oracle Corporation","www.oracle.com"]
["ORACL006","Oracle Certified Master (OCM): Java Developer","Oracle Corporation","www.oracle.com"]
["ORACL007","Oracle Certified Expert (OCE): Database SQL","Oracle Corporation","www.oracle.com"]
["PRMIN001","Project Management Professional (PMP)","Project Management Institute","www.pmi.org"]
["PRMIN003","Certified Associate in Project Management (CAPM)","Project Management Institute","www.pmi.org"]
["PROSO003","Certified Internet Web (CIW) E-Commerce Specialist","Certification Partners","www.ciwcertified.com"]
["PROSO006","Certified Internet Web (CIW) Database Design Specialist","Certification Partners","www.ciwcertified.com"]
["PROSO010","Certified Internet Web (CIW) Web Security Professional","Certification Partners","www.ciwcertified.com"]
["PROSO016","Certified Internet Web (CIW) Internet Business Associate","Certification Partners","www.ciwcertified.com"]
["PROSO017","Certified Internet Web (CIW) JavaScript Specialist","Certification Partners","www.ciwcertified.com"]
["PROSO018","Certified Internet Web (CIW) Network Technology Associate","Certification Partners","www.ciwcertified.com"]
["PROSO019","Certified Internet Web (CIW) Perl Specialist","Certification Partners","www.ciwcertified.com"]
["PROSO020","Certified Internet Web (CIW) Site Development Associate","Certification Partners","www.ciwcertified.com"]
["PROSO021","Certified Internet Web (CIW) Web Design Professional","Certification Partners","www.ciwcertified.com"]
["PROSO022","Certified Internet Web (CIW) Web Design Specialist","Certification Partners","www.ciwcertified.com"]
["PROSO023","Certified Internet Web (CIW) Web Development Professional","Certification Partners","www.ciwcertified.com"]
["PROSO024","Certified Internet Web (CIW) Web Foundations Associate","Certification Partners","www.ciwcertified.com"]
["PROSO025","Certified Internet Web (CIW) Web Security Associate","Certification Partners","www.ciwcertified.com"]
["PROSO026","Certified Internet Web (CIW) Web Security Specialist","Certification Partners","www.ciwcertified.com"]
["PROSO027","Certified Internet Web (CIW) Advanced HTML5 & CSS3 Specialist","Certification Partners","www.ciwcertified.com"]
["PROSO028","Certified Internet Web (CIW) Data Analyst","Certification Partners","www.ciwcertified.com"]
["PROSO029","Certified Internet Web (CIW) User Interface Designer","Certification Partners","www.ciwcertified.com"]
["PROSO030","Certified Internet Web (CIW) Data Analyst Specialist","Certification Partners","www.ciwcertified.com"]
["PROSO031","Certified Internet Web (CIW) Social Media Strategist","Certification Partners","www.ciwcertified.com"]
["PROSO032","Certified Internet Web (CIW) User Interface Designer","Certification Partners","www.ciwcertified.com"]
["PTCBD001","Pharmacy Technician","Pharmacy Technician Certification Board","www.ptcb.org/"]
["SALES001","Salesforce Certified Administrator","Salesforce","www.salesforce.com"]
["SMFEN001","Lean Bronze Certification (LBC)","Society of Manufacturing Engineers","www.sme.org"]
["SMRPR001","Certified Maintenance and Reliability Professional (CMRP)","Society for Maintenance and Reliability Professionals","www.smrp.org"]
["SOCTE004","Broadband Premises Installer (BPI)","Society of Cable Telecommunications Engineers","www.scte.org/"]
["SOLID003","Certified Solidworks Associate-Academic (CSWA-Academic)","Dassault Systems Solidworks Corporation","www.solidworks.com/pages/services/Training/Training.html"]
["SOLID004","Certified Solidworks Professional-Academic (CSWP-Academic)","Dassault Systems Solidworks Corporation","www.solidworks.com/pages/services/Training/Training.html"]
["SPACE001","Aerospace Technician","SpaceTec","www.spacetec.org/"]
["TAFLP001","Accredited Legal Professional (ALP)","NALS…the Association for Legal Professionals","www.nals.org"]
["TAFLP002","Professional Legal Secretary (PLS)","NALS…the Association for Legal Professionals","www.nals.org"]
["TAFOM001","Certified in Production and Inventory Management (CPIM) ","American Production and Inventory Control Society (APICS)","www.apics.org"]
["TBOOM001","Toon Boom Certified Associate (Harmony Premium)","Toon Boom Animation","www.toonboom.com/"]
["TBOOM003","Toon Boom Certified Associate (Storyboard Pro)","Toon Boom Animation","www.toonboom.com/"]
["UNITY001","Unity Certified Associate","Unity Technologies","https://certification.unity.com"]
["UNITY002","Unity Certified User: Programmer","Unity Technologies","https://certification.unity.com"]
["USINS001","Small UAS Safety Certification","Unmanned Safety Institute","unmannedsafetyinstitute.org/"]
["VMWRE004","VMware Certified Professional - Data Center Virtualization","VMWare","www.vmware.com"]

{"sheet":"SOC Lookups","index":7,"n_rows":848,"n_cols":3,"rows_kept":848,"cut":false,"hidden":true,"merged":[]}
[null,"2010 SOC codes","Detailed Occupation Title"]
["_"]
[{"$f":"CONCATENATE(\"(\",B3,\") \",C3)","v":"(11-1011) Chief Executives"},"11-1011","Chief Executives"]
[{"$f":"CONCATENATE(\"(\",B4,\") \",C4)","v":"(11-1021) General and Operations Managers"},"11-1021","General and Operations Managers"]
["(11-1031) Legislators","11-1031","Legislators"]
["(11-2011) Advertising and Promotions Managers","11-2011","Advertising and Promotions Managers"]
["(11-2021) Marketing Managers","11-2021","Marketing Managers"]
["(11-2022) Sales Managers","11-2022","Sales Managers"]
["(11-2031) Public Relations and Fundraising Managers","11-2031","Public Relations and Fundraising Managers"]
["(11-3011) Administrative Services Managers","11-3011","Administrative Services Managers"]
["(11-3011 ) Administrative Services Managers","11-3011 ","Administrative Services Managers"]
["(11-3021) Computer and Information Systems Managers","11-3021","Computer and Information Systems Managers"]
["(11-3031) Financial Managers","11-3031","Financial Managers"]
["(11-3051) Industrial Production Managers","11-3051","Industrial Production Managers"]
["(11-3061) Purchasing Managers","11-3061","Purchasing Managers"]
["(11-3071) Transportation, Storage, and Distribution Managers","11-3071","Transportation, Storage, and Distribution Managers"]
["(11-3111) Compensation and Benefits Managers","11-3111","Compensation and Benefits Managers"]
["(11-3121) Human Resources Managers","11-3121","Human Resources Managers"]
["(11-3131) Training and Development Managers","11-3131","Training and Development Managers"]
["(11-9013) Farmers, Ranchers, and Other Agricultural Managers","11-9013","Farmers, Ranchers, and Other Agricultural Managers"]
["(11-9021) Construction Managers","11-9021","Construction Managers"]
["(11-9031) Education Administrators, Preschool and Childcare Center/Program","11-9031","Education Administrators, Preschool and Childcare Center/Program"]
["(11-9032) Education Administrators, Elementary and Secondary School","11-9032","Education Administrators, Elementary and Secondary School"]
["(11-9033) Education Administrators, Postsecondary","11-9033","Education Administrators, Postsecondary"]
["(11-9041) Architectural and Engineering Managers","11-9041","Architectural and Engineering Managers"]
["(11-9051) Food Service Managers","11-9051","Food Service Managers"]
["(11-9061) Funeral Service Managers","11-9061","Funeral Service Managers"]
["(11-9071) Gaming Managers","11-9071","Gaming Managers"]
["(11-9081) Lodging Managers","11-9081","Lodging Managers"]
["(11-9111) Medical and Health Services Managers","11-9111","Medical and Health Services Managers"]
["(11-9121) Natural Sciences Managers","11-9121","Natural Sciences Managers"]
["(11-9131) Postmasters and Mail Superintendents","11-9131","Postmasters and Mail Superintendents"]
["(11-9141) Property, Real Estate, and Community Association Managers","11-9141","Property, Real Estate, and Community Association Managers"]
["(11-9151) Social and Community Service Managers","11-9151","Social and Community Service Managers"]
["(11-9161) Emergency Management Directors","11-9161","Emergency Management Directors"]
["(11-9199) Managers, All Other","11-9199","Managers, All Other"]
["(13-1011) Agents and Business Managers of Artists, Performers, and Athletes","13-1011","Agents and Business Managers of Artists, Performers, and Athletes"]
["(13-1021) Buyers and Purchasing Agents, Farm Products","13-1021","Buyers and Purchasing Agents, Farm Products"]
["(13-1022) Wholesale and Retail Buyers, Except Farm Products","13-1022","Wholesale and Retail Buyers, Except Farm Products"]
["(13-1023) Purchasing Agents, Except Wholesale, Retail, and Farm Products","13-1023","Purchasing Agents, Except Wholesale, Retail, and Farm Products"]
["(13-1031) Claims Adjusters, Examiners, and Investigators","13-1031","Claims Adjusters, Examiners, and Investigators"]
["(13-1032) Insurance Appraisers, Auto Damage","13-1032","Insurance Appraisers, Auto Damage"]
["(13-1041) Compliance Officers","13-1041","Compliance Officers"]
["(13-1051) Cost Estimators","13-1051","Cost Estimators"]
["(13-1071) Human Resources Specialists","13-1071","Human Resources Specialists"]
["(13-1074) Farm Labor Contractors","13-1074","Farm Labor Contractors"]
["(13-1075) Labor Relations Specialists","13-1075","Labor Relations Specialists"]
["(13-1081) Logisticians","13-1081","Logisticians"]
["(13-1111) Management Analysts","13-1111","Management Analysts"]
["(13-1121) Meeting, Convention, and Event Planners","13-1121","Meeting, Convention, and Event Planners"]
["(13-1131) Fundraisers","13-1131","Fundraisers"]
["(13-1141) Compensation, Benefits, and Job Analysis Specialists","13-1141","Compensation, Benefits, and Job Analysis Specialists"]
["(13-1151) Training and Development Specialists","13-1151","Training and Development Specialists"]
["(13-1161) Market Research Analysts and Marketing Specialists","13-1161","Market Research Analysts and Marketing Specialists"]
["(13-1199) Business Operations Specialists, All Other","13-1199","Business Operations Specialists, All Other"]
["(13-2011) Accountants and Auditors","13-2011","Accountants and Auditors"]
["(13-2021) Appraisers and Assessors of Real Estate","13-2021","Appraisers and Assessors of Real Estate"]
["(13-2031) Budget Analysts","13-2031","Budget Analysts"]
["(13-2041) Credit Analysts","13-2041","Credit Analysts"]
["(13-2051) Financial Analysts","13-2051","Financial Analysts"]
["(13-2052) Personal Financial Advisors","13-2052","Personal Financial Advisors"]
["(13-2053) Insurance Underwriters","13-2053","Insurance Underwriters"]
["(13-2061) Financial Examiners","13-2061","Financial Examiners"]
["(13-2071) Credit Counselors","13-2071","Credit Counselors"]
["(13-2072) Loan Officers","13-2072","Loan Officers"]
["(13-2081) Tax Examiners and Collectors, and Revenue Agents","13-2081","Tax Examiners and Collectors, and Revenue Agents"]
["(13-2082) Tax Preparers","13-2082","Tax Preparers"]
[{"$f":"CONCATENATE(\"(\",B68,\") \",C68)","v":"(13-2099) Financial Specialists, All Other"},"13-2099","Financial Specialists, All Other"]
["(15-1111) Computer and Information Research Scientists","15-1111","Computer and Information Research Scientists"]
["(15-1121) Computer Systems Analysts","15-1121","Computer Systems Analysts"]
["(15-1122) Information Security Analysts","15-1122","Information Security Analysts"]
["(15-1131) Computer Programmers","15-1131","Computer Programmers"]
["(15-1132) Software Developers, Applications","15-1132","Software Developers, Applications"]
["(15-1133) Software Developers, Systems Software","15-1133","Software Developers, Systems Software"]
["(15-1134) Web Developers","15-1134","Web Developers"]
["(15-1141) Database Administrators","15-1141","Database Administrators"]
["(15-1142) Network and Computer Systems Administrators","15-1142","Network and Computer Systems Administrators"]
["(15-1143) Computer Network Architects","15-1143","Computer Network Architects"]
["(15-1151) Computer User Support Specialists","15-1151","Computer User Support Specialists"]
["(15-1152) Computer Network Support Specialists","15-1152","Computer Network Support Specialists"]
["(15-1199) Computer Occupations, All Other","15-1199","Computer Occupations, All Other"]
["(15-2011) Actuaries","15-2011","Actuaries"]
["(15-2021) Mathematicians","15-2021","Mathematicians"]
["(15-2031) Operations Research Analysts","15-2031","Operations Research Analysts"]
["(15-2041) Statisticians","15-2041","Statisticians"]
["(15-2091) Mathematical Technicians","15-2091","Mathematical Technicians"]
["(15-2099) Mathematical Science Occupations, All Other","15-2099","Mathematical Science Occupations, All Other"]
["(17-1011) Architects, Except Landscape and Naval","17-1011","Architects, Except Landscape and Naval"]
["(17-1012) Landscape Architects","17-1012","Landscape Architects"]
["(17-1021) Cartographers and Photogrammetrists","17-1021","Cartographers and Photogrammetrists"]
["(17-1022) Surveyors","17-1022","Surveyors"]
["(17-2011) Aerospace Engineers","17-2011","Aerospace Engineers"]
["(17-2021) Agricultural Engineers","17-2021","Agricultural Engineers"]
["(17-2031) Biomedical Engineers","17-2031","Biomedical Engineers"]
["(17-2041) Chemical Engineers","17-2041","Chemical Engineers"]
["(17-2051) Civil Engineers","17-2051","Civil Engineers"]
["(17-2061) Computer Hardware Engineers","17-2061","Computer Hardware Engineers"]
["(17-2071) Electrical Engineers","17-2071","Electrical Engineers"]
["(17-2072) Electronics Engineers, Except Computer","17-2072","Electronics Engineers, Except Computer"]
["(17-2081) Environmental Engineers","17-2081","Environmental Engineers"]
["(17-2111) Health and Safety Engineers, Except Mining Safety Engineers and Inspectors","17-2111","Health and Safety Engineers, Except Mining Safety Engineers and Inspectors"]
["(17-2112) Industrial Engineers","17-2112","Industrial Engineers"]
["(17-2121) Marine Engineers and Naval Architects","17-2121","Marine Engineers and Naval Architects"]
["(17-2131) Materials Engineers","17-2131","Materials Engineers"]
["(17-2141) Mechanical Engineers","17-2141","Mechanical Engineers"]
["(17-2151) Mining and Geological Engineers, Including Mining Safety Engineers","17-2151","Mining and Geological Engineers, Including Mining Safety Engineers"]
["(17-2161) Nuclear Engineers","17-2161","Nuclear Engineers"]
["(17-2171) Petroleum Engineers","17-2171","Petroleum Engineers"]
["(17-2199) Engineers, All Other","17-2199","Engineers, All Other"]
["(17-3011) Architectural and Civil Drafters","17-3011","Architectural and Civil Drafters"]
["(17-3012) Electrical and Electronics Drafters","17-3012","Electrical and Electronics Drafters"]
["(17-3013) Mechanical Drafters","17-3013","Mechanical Drafters"]
["(17-3019) Drafters, All Other","17-3019","Drafters, All Other"]
["(17-3021) Aerospace Engineering and Operations Technicians","17-3021","Aerospace Engineering and Operations Technicians"]
["(17-3022) Civil Engineering Technicians","17-3022","Civil Engineering Technicians"]
["(17-3023) Electrical and Electronics Engineering Technicians","17-3023","Electrical and Electronics Engineering Technicians"]
["(17-3023) Electrical and Electronic Engineering Technicians","17-3023","Electrical and Electronic Engineering Technicians"]
["(17-3024) Electro-Mechanical Technicians","17-3024","Electro-Mechanical Technicians"]
["(17-3025) Environmental Engineering Technicians","17-3025","Environmental Engineering Technicians"]
["(17-3026) Industrial Engineering Technicians","17-3026","Industrial Engineering Technicians"]
["(17-3027) Mechanical Engineering Technicians","17-3027","Mechanical Engineering Technicians"]
["(17-3029) Engineering Technicians, Except Drafters, All Other","17-3029","Engineering Technicians, Except Drafters, All Other"]
["(17-3031) Surveying and Mapping Technicians","17-3031","Surveying and Mapping Technicians"]
["(19-1011) Animal Scientists","19-1011","Animal Scientists"]
["(19-1012) Food Scientists and Technologists","19-1012","Food Scientists and Technologists"]
["(19-1013) Soil and Plant Scientists","19-1013","Soil and Plant Scientists"]
["(19-1021) Biochemists and Biophysicists","19-1021","Biochemists and Biophysicists"]
["(19-1022) Microbiologists","19-1022","Microbiologists"]
["(19-1023) Zoologists and Wildlife Biologists","19-1023","Zoologists and Wildlife Biologists"]
["(19-1029) Biological Scientists, All Other","19-1029","Biological Scientists, All Other"]
["(19-1031) Conservation Scientists","19-1031","Conservation Scientists"]
[{"$f":"CONCATENATE(\"(\",B132,\") \",C132)","v":"(19-1032) Foresters"},"19-1032","Foresters"]
["(19-1041) Epidemiologists","19-1041","Epidemiologists"]
["(19-1042) Medical Scientists, Except Epidemiologists","19-1042","Medical Scientists, Except Epidemiologists"]
["(19-1099) Life Scientists, All Other","19-1099","Life Scientists, All Other"]
["(19-2011) Astronomers","19-2011","Astronomers"]
["(19-2012) Physicists","19-2012","Physicists"]
["(19-2021) Atmospheric and Space Scientists","19-2021","Atmospheric and Space Scientists"]
["(19-2031) Chemists","19-2031","Chemists"]
["(19-2032) Materials Scientists","19-2032","Materials Scientists"]
["(19-2041) Environmental Scientists and Specialists, Including Health","19-2041","Environmental Scientists and Specialists, Including Health"]
["(19-2042) Geoscientists, Except Hydrologists and Geographers","19-2042","Geoscientists, Except Hydrologists and Geographers"]
["(19-2043) Hydrologists","19-2043","Hydrologists"]
["(19-2099) Physical Scientists, All Other","19-2099","Physical Scientists, All Other"]
["(19-3011) Economists","19-3011","Economists"]
["(19-3022) Survey Researchers","19-3022","Survey Researchers"]
["(19-3031) Clinical, Counseling, and School Psychologists","19-3031","Clinical, Counseling, and School Psychologists"]
["(19-3032) Industrial-Organizational Psychologists","19-3032","Industrial-Organizational Psychologists"]
["(19-3039) Psychologists, All Other","19-3039","Psychologists, All Other"]
["(19-3041) Sociologists","19-3041","Sociologists"]
["(19-3051) Urban and Regional Planners","19-3051","Urban and Regional Planners"]
["(19-3091) Anthropologists and Archeologists","19-3091","Anthropologists and Archeologists"]
["(19-3092) Geographers","19-3092","Geographers"]
["(19-3093) Historians","19-3093","Historians"]
["(19-3094) Political Scientists","19-3094","Political Scientists"]
["(19-3099) Social Scientists and Related Workers, All Other","19-3099","Social Scientists and Related Workers, All Other"]
["(19-4011) Agricultural and Food Science Technicians","19-4011","Agricultural and Food Science Technicians"]
["(19-4021) Biological Technicians","19-4021","Biological Technicians"]
["(19-4031) Chemical Technicians","19-4031","Chemical Technicians"]
["(19-4041) Geological and Petroleum Technicians","19-4041","Geological and Petroleum Technicians"]
["(19-4051) Nuclear Technicians","19-4051","Nuclear Technicians"]
["(19-4061) Social Science Research Assistants","19-4061","Social Science Research Assistants"]
["(19-4091) Environmental Science and Protection Technicians, Including Health","19-4091","Environmental Science and Protection Technicians, Including Health"]
["(19-4092) Forensic Science Technicians","19-4092","Forensic Science Technicians"]
["(19-4093) Forest and Conservation Technicians","19-4093","Forest and Conservation Technicians"]
["(19-4099) Life, Physical, and Social Science Technicians, All Other","19-4099","Life, Physical, and Social Science Technicians, All Other"]
["(21-1011) Substance Abuse and Behavioral Disorder Counselors","21-1011","Substance Abuse and Behavioral Disorder Counselors"]
["(21-1012) Educational, Guidance, School, and Vocational Counselors","21-1012","Educational, Guidance, School, and Vocational Counselors"]
["(21-1013) Marriage and Family Therapists","21-1013","Marriage and Family Therapists"]
["(21-1014) Mental Health Counselors","21-1014","Mental Health Counselors"]
["(21-1015) Rehabilitation Counselors","21-1015","Rehabilitation Counselors"]
["(21-1019) Counselors, All Other","21-1019","Counselors, All Other"]
["(21-1021) Child, Family, and School Social Workers","21-1021","Child, Family, and School Social Workers"]
["(21-1022) Health Care Social Workers","21-1022","Health Care Social Workers"]
["(21-1022) Healthcare Social Workers","21-1022","Healthcare Social Workers"]
["(21-1023) Mental Health and Substance Abuse Social Workers","21-1023","Mental Health and Substance Abuse Social Workers"]
["(21-1029) Social Workers, All Other","21-1029","Social Workers, All Other"]
["(21-1091) Health Educators","21-1091","Health Educators"]
["(21-1092) Probation Officers and Correctional Treatment Specialists","21-1092","Probation Officers and Correctional Treatment Specialists"]
["(21-1093) Social and Human Service Assistants","21-1093","Social and Human Service Assistants"]
["(21-1094) Community Health Workers","21-1094","Community Health Workers"]
["(21-1099) Community and Social Service Specialists, All Other","21-1099","Community and Social Service Specialists, All Other"]
["(21-2011) Clergy","21-2011","Clergy"]
["(21-2021) Directors, Religious Activities and Education","21-2021","Directors, Religious Activities and Education"]
["(21-2099) Religious Workers, All Other","21-2099","Religious Workers, All Other"]
["(23-1011) Lawyers","23-1011","Lawyers"]
["(23-1012) Judicial Law Clerks","23-1012","Judicial Law Clerks"]
["(23-1021) Administrative Law Judges, Adjudicators, and Hearing Officers","23-1021","Administrative Law Judges, Adjudicators, and Hearing Officers"]
["(23-1022) Arbitrators, Mediators, and Conciliators","23-1022","Arbitrators, Mediators, and Conciliators"]
["(23-1023) Judges, Magistrate Judges, and Magistrates","23-1023","Judges, Magistrate Judges, and Magistrates"]
["(23-2011) Paralegals and Legal Assistants","23-2011","Paralegals and Legal Assistants"]
["(23-2091) Court Reporters","23-2091","Court Reporters"]
["(23-2093) Title Examiners, Abstractors, and Searchers","23-2093","Title Examiners, Abstractors, and Searchers"]
["(23-2099) Legal Support Workers, All Other","23-2099","Legal Support Workers, All Other"]
["(25-1011) Business Teachers, Postsecondary","25-1011","Business Teachers, Postsecondary"]
[{"$f":"CONCATENATE(\"(\",B196,\") \",C196)","v":"(25-1021) Computer Science Teachers, Postsecondary"},"25-1021","Computer Science Teachers, Postsecondary"]
["(25-1022) Mathematical Science Teachers, Postsecondary","25-1022","Mathematical Science Teachers, Postsecondary"]
["(25-1031) Architecture Teachers, Postsecondary","25-1031","Architecture Teachers, Postsecondary"]
["(25-1032) Engineering Teachers, Postsecondary","25-1032","Engineering Teachers, Postsecondary"]
["(25-1041) Agricultural Sciences Teachers, Postsecondary","25-1041","Agricultural Sciences Teachers, Postsecondary"]
["(25-1042) Biological Science Teachers, Postsecondary","25-1042","Biological Science Teachers, Postsecondary"]
["(25-1043) Forestry and Conservation Science Teachers, Postsecondary","25-1043","Forestry and Conservation Science Teachers, Postsecondary"]
["(25-1051) Atmospheric, Earth, Marine, and Space Sciences Teachers, Postsecondary","25-1051","Atmospheric, Earth, Marine, and Space Sciences Teachers, Postsecondary"]
["(25-1052) Chemistry Teachers, Postsecondary","25-1052","Chemistry Teachers, Postsecondary"]
["(25-1053) Environmental Science Teachers, Postsecondary","25-1053","Environmental Science Teachers, Postsecondary"]
["(25-1054) Physics Teachers, Postsecondary","25-1054","Physics Teachers, Postsecondary"]
["(25-1061) Anthropology and Archeology Teachers, Postsecondary","25-1061","Anthropology and Archeology Teachers, Postsecondary"]
["(25-1062) Area, Ethnic, and Cultural Studies Teachers, Postsecondary","25-1062","Area, Ethnic, and Cultural Studies Teachers, Postsecondary"]
["(25-1063) Economics Teachers, Postsecondary","25-1063","Economics Teachers, Postsecondary"]
["(25-1064) Geography Teachers, Postsecondary","25-1064","Geography Teachers, Postsecondary"]
["(25-1065) Political Science Teachers, Postsecondary","25-1065","Political Science Teachers, Postsecondary"]
["(25-1066) Psychology Teachers, Postsecondary","25-1066","Psychology Teachers, Postsecondary"]
["(25-1067) Sociology Teachers, Postsecondary","25-1067","Sociology Teachers, Postsecondary"]
["(25-1069) Social Sciences Teachers, Postsecondary, All Other","25-1069","Social Sciences Teachers, Postsecondary, All Other"]
["(25-1071) Health Specialties Teachers, Postsecondary","25-1071","Health Specialties Teachers, Postsecondary"]
["(25-1072) Nursing Instructors and Teachers, Postsecondary","25-1072","Nursing Instructors and Teachers, Postsecondary"]
["(25-1081) Education Teachers, Postsecondary","25-1081","Education Teachers, Postsecondary"]
["(25-1082) Library Science Teachers, Postsecondary","25-1082","Library Science Teachers, Postsecondary"]
["(25-1111) Criminal Justice and Law Enforcement Teachers, Postsecondary","25-1111","Criminal Justice and Law Enforcement Teachers, Postsecondary"]
["(25-1112) Law Teachers, Postsecondary","25-1112","Law Teachers, Postsecondary"]
["(25-1113) Social Work Teachers, Postsecondary","25-1113","Social Work Teachers, Postsecondary"]
["(25-1121) Art, Drama, and Music Teachers, Postsecondary","25-1121","Art, Drama, and Music Teachers, Postsecondary"]
["(25-1122) Communications Teachers, Postsecondary","25-1122","Communications Teachers, Postsecondary"]
["(25-1123) English Language and Literature Teachers, Postsecondary","25-1123","English Language and Literature Teachers, Postsecondary"]
["(25-1124) Foreign Language and Literature Teachers, Postsecondary","25-1124","Foreign Language and Literature Teachers, Postsecondary"]
["(25-1125) History Teachers, Postsecondary","25-1125","History Teachers, Postsecondary"]
["(25-1126) Philosophy and Religion Teachers, Postsecondary","25-1126","Philosophy and Religion Teachers, Postsecondary"]
["(25-1191) Graduate Teaching Assistants","25-1191","Graduate Teaching Assistants"]
["(25-1192) Home Economics Teachers, Postsecondary","25-1192","Home Economics Teachers, Postsecondary"]
["(25-1193) Recreation and Fitness Studies Teachers, Postsecondary","25-1193","Recreation and Fitness Studies Teachers, Postsecondary"]
["(25-1194) Vocational Education Teachers, Postsecondary","25-1194","Vocational Education Teachers, Postsecondary"]
["(25-1199) Postsecondary Teachers, All Other","25-1199","Postsecondary Teachers, All Other"]
["(25-2011) Preschool Teachers, Except Special Education","25-2011","Preschool Teachers, Except Special Education"]
["(25-2012) Kindergarten Teachers, Except Special Education","25-2012","Kindergarten Teachers, Except Special Education"]
["(25-2021) Elementary School Teachers, Except Special Education","25-2021","Elementary School Teachers, Except Special Education"]
["(25-2022) Middle School Teachers, Except Special and Career/Technical Education","25-2022","Middle School Teachers, Except Special and Career/Technical Education"]
["(25-2023) Career/Technical Education Teachers, Middle School","25-2023","Career/Technical Education Teachers, Middle School"]
["(25-2031) Secondary School Teachers, Except Special and Career/Technical Education","25-2031","Secondary School Teachers, Except Special and Career/Technical Education"]
["(25-2032) Career/Technical Education Teachers, Secondary School","25-2032","Career/Technical Education Teachers, Secondary School"]
["(25-2051) Special Education Teachers, Preschool","25-2051","Special Education Teachers, Preschool"]
["(25-2052) Special Education Teachers, Kindergarten, and Elementary School","25-2052","Special Education Teachers, Kindergarten, and Elementary School"]
["(25-2053) Special Education Teachers, Middle School","25-2053","Special Education Teachers, Middle School"]
["(25-2054) Special Education Teachers, Secondary School","25-2054","Special Education Teachers, Secondary School"]
["(25-2059) Special Education Teachers, All Other","25-2059","Special Education Teachers, All Other"]
["(25-3011) Adult Basic and Secondary Education and Literacy Teachers and Instructors","25-3011","Adult Basic and Secondary Education and Literacy Teachers and Instructors"]
["(25-3011) Adult Basic and Secondary Education and Literacy Teachers and Instructors ","25-3011","Adult Basic and Secondary Education and Literacy Teachers and Instructors "]
["(25-3021) Self-Enrichment Education Teachers","25-3021","Self-Enrichment Education Teachers"]
["(25-3099) Teachers and Instructors, All Other","25-3099","Teachers and Instructors, All Other"]
["(25-4011) Archivists","25-4011","Archivists"]
["(25-4012) Curators","25-4012","Curators"]
["(25-4013) Museum Technicians and Conservators","25-4013","Museum Technicians and Conservators"]
["(25-4021) Librarians","25-4021","Librarians"]
["(25-4031) Library Technicians","25-4031","Library Technicians"]
["(25-9011) Audio-Visual and Multimedia Collections Specialists","25-9011","Audio-Visual and Multimedia Collections Specialists"]
["(25-9021) Farm and Home Management Advisors","25-9021","Farm and Home Management Advisors"]
["(25-9031) Instructional Coordinators","25-9031","Instructional Coordinators"]
["(25-9041) Teacher Assistants","25-9041","Teacher Assistants"]
["(25-9099) Education, Training, and Library Workers, All Other","25-9099","Education, Training, and Library Workers, All Other"]
["(27-1011) Art Directors","27-1011","Art Directors"]
[{"$f":"CONCATENATE(\"(\",B260,\") \",C260)","v":"(27-1012) Craft Artists"},"27-1012","Craft Artists"]
["(27-1013) Fine Artists, Including Painters, Sculptors, and Illustrators","27-1013","Fine Artists, Including Painters, Sculptors, and Illustrators"]
["(27-1014) Multimedia Artists and Animators","27-1014","Multimedia Artists and Animators"]
["(27-1019) Artists and Related Workers, All Other","27-1019","Artists and Related Workers, All Other"]
["(27-1021) Commercial and Industrial Designers","27-1021","Commercial and Industrial Designers"]
["(27-1022) Fashion Designers","27-1022","Fashion Designers"]
["(27-1023) Floral Designers","27-1023","Floral Designers"]
["(27-1024) Graphic Designers","27-1024","Graphic Designers"]
["(27-1025) Interior Designers","27-1025","Interior Designers"]
["(27-1026) Merchandise Displayers and Window Trimmers","27-1026","Merchandise Displayers and Window Trimmers"]
["(27-1027) Set and Exhibit Designers","27-1027","Set and Exhibit Designers"]
["(27-1029) Designers, All Other","27-1029","Designers, All Other"]
["(27-2011) Actors","27-2011","Actors"]
["(27-2012) Producers and Directors","27-2012","Producers and Directors"]
["(27-2021) Athletes and Sports Competitors","27-2021","Athletes and Sports Competitors"]
["(27-2022) Coaches and Scouts","27-2022","Coaches and Scouts"]
["(27-2023) Umpires, Referees, and Other Sports Officials","27-2023","Umpires, Referees, and Other Sports Officials"]
["(27-2031) Dancers","27-2031","Dancers"]
["(27-2032) Choreographers","27-2032","Choreographers"]
["(27-2041) Music Directors and Composers","27-2041","Music Directors and Composers"]
["(27-2042) Musicians and Singers","27-2042","Musicians and Singers"]
["(27-2099) Entertainers and Performers, Sports and Related Workers, All Other","27-2099","Entertainers and Performers, Sports and Related Workers, All Other"]
["(27-3011) Radio and Television Announcers","27-3011","Radio and Television Announcers"]
["(27-3012) Public Address System and Other Announcers","27-3012","Public Address System and Other Announcers"]
["(27-3021) Broadcast News Analysts","27-3021","Broadcast News Analysts"]
["(27-3022) Reporters and Correspondents","27-3022","Reporters and Correspondents"]
["(27-3031) Public Relations Specialists","27-3031","Public Relations Specialists"]
["(27-3041) Editors","27-3041","Editors"]
["(27-3042) Technical Writers","27-3042","Technical Writers"]
["(27-3043) Writers and Authors","27-3043","Writers and Authors"]
["(27-3091) Interpreters and Translators","27-3091","Interpreters and Translators"]
["(27-3099) Media and Communication Workers, All Other","27-3099","Media and Communication Workers, All Other"]
["(27-4011) Audio and Video Equipment Technicians","27-4011","Audio and Video Equipment Technicians"]
["(27-4012) Broadcast Technicians","27-4012","Broadcast Technicians"]
["(27-4013) Radio Operators","27-4013","Radio Operators"]
["(27-4014) Sound Engineering Technicians","27-4014","Sound Engineering Technicians"]
["(27-4021) Photographers","27-4021","Photographers"]
["(27-4031) Camera Operators, Television, Video, and Motion Picture","27-4031","Camera Operators, Television, Video, and Motion Picture"]
["(27-4032) Film and Video Editors","27-4032","Film and Video Editors"]
["(27-4099) Media and Communication Equipment Workers, All Other","27-4099","Media and Communication Equipment Workers, All Other"]
["(29-1011) Chiropractors","29-1011","Chiropractors"]
["(29-1021) Dentists, General","29-1021","Dentists, General"]
["(29-1022) Oral and Maxillofacial Surgeons","29-1022","Oral and Maxillofacial Surgeons"]
["(29-1023) Orthodontists","29-1023","Orthodontists"]
["(29-1024) Prosthodontists","29-1024","Prosthodontists"]
["(29-1029) Dentists, All Other Specialists","29-1029","Dentists, All Other Specialists"]
["(29-1031) Dietitians and Nutritionists","29-1031","Dietitians and Nutritionists"]
["(29-1041) Optometrists","29-1041","Optometrists"]
["(29-1051) Pharmacists","29-1051","Pharmacists"]
["(29-1061) Anesthesiologists","29-1061","Anesthesiologists"]
["(29-1062) Family and General Practitioners","29-1062","Family and General Practitioners"]
["(29-1063) Internists, General","29-1063","Internists, General"]
["(29-1064) Obstetricians and Gynecologists","29-1064","Obstetricians and Gynecologists"]
["(29-1065) Pediatricians, General","29-1065","Pediatricians, General"]
["(29-1066) Psychiatrists","29-1066","Psychiatrists"]
["(29-1067) Surgeons","29-1067","Surgeons"]
["(29-1069) Physicians and Surgeons, All Other","29-1069","Physicians and Surgeons, All Other"]
["(29-1071) Physician Assistants","29-1071","Physician Assistants"]
["(29-1081) Podiatrists","29-1081","Podiatrists"]
["(29-1122) Occupational Therapists","29-1122","Occupational Therapists"]
["(29-1123) Physical Therapists","29-1123","Physical Therapists"]
["(29-1124) Radiation Therapists","29-1124","Radiation Therapists"]
["(29-1125) Recreational Therapists","29-1125","Recreational Therapists"]
["(29-1126) Respiratory Therapists","29-1126","Respiratory Therapists"]
[{"$f":"CONCATENATE(\"(\",B324,\") \",C324)","v":"(29-1127) Speech-language Pathologists"},"29-1127","Speech-language Pathologists"]
["(29-1128) Exercise Physiologists","29-1128","Exercise Physiologists"]
["(29-1129) Therapists, All Other","29-1129","Therapists, All Other"]
["(29-1131) Veterinarians","29-1131","Veterinarians"]
["(29-1141) Registered Nurses","29-1141","Registered Nurses"]
["(29-1151) Nurse Anesthetists","29-1151","Nurse Anesthetists"]
["(29-1161) Nurse Midwives","29-1161","Nurse Midwives"]
["(29-1171) Nurse Practitioners","29-1171","Nurse Practitioners"]
["(29-1181) Audiologists","29-1181","Audiologists"]
["(29-1199) Health Diagnosing and Treating Practitioners, All Other","29-1199","Health Diagnosing and Treating Practitioners, All Other"]
["(29-2011) Medical and Clinical Laboratory Technologists","29-2011","Medical and Clinical Laboratory Technologists"]
["(29-2012) Medical and Clinical Laboratory Technicians","29-2012","Medical and Clinical Laboratory Technicians"]
["(29-2021) Dental Hygienists","29-2021","Dental Hygienists"]
["(29-2031) Cardiovascular Technologists and Technicians","29-2031","Cardiovascular Technologists and Technicians"]
["(29-2032) Diagnostic Medical Sonographers","29-2032","Diagnostic Medical Sonographers"]
["(29-2033) Nuclear Medicine Technologists","29-2033","Nuclear Medicine Technologists"]
["(29-2034) Radiologic Technologists","29-2034","Radiologic Technologists"]
["(29-2035 ) Magnetic Resonance Imaging Technologists","29-2035 ","Magnetic Resonance Imaging Technologists"]
["(29-2041) Emergency Medical Technicians and Paramedics","29-2041","Emergency Medical Technicians and Paramedics"]
["(29-2051) Dietetic Technicians","29-2051","Dietetic Technicians"]
["(29-2052) Pharmacy Technicians","29-2052","Pharmacy Technicians"]
["(29-2053) Psychiatric Technicians","29-2053","Psychiatric Technicians"]
["(29-2054) Respiratory Therapy Technicians","29-2054","Respiratory Therapy Technicians"]
["(29-2055) Surgical Technologists","29-2055","Surgical Technologists"]
["(29-2056) Veterinary Technologists and Technicians","29-2056","Veterinary Technologists and Technicians"]
["(29-2057) Ophthalmic Medical Technicians","29-2057","Ophthalmic Medical Technicians"]
["(29-2061) Licensed Practical and Licensed Vocational Nurses","29-2061","Licensed Practical and Licensed Vocational Nurses"]
["(29-2071) Medical Records and Health Information Technicians","29-2071","Medical Records and Health Information Technicians"]
["(29-2081) Opticians, Dispensing","29-2081","Opticians, Dispensing"]
["(29-2091) Orthotists and Prosthetists","29-2091","Orthotists and Prosthetists"]
["(29-2092) Hearing Aid Specialists","29-2092","Hearing Aid Specialists"]
["(29-2099) Health Technologists and Technicians, All Other","29-2099","Health Technologists and Technicians, All Other"]
["(29-9011) Occupational Health and Safety Specialists","29-9011","Occupational Health and Safety Specialists"]
["(29-9012) Occupational Health and Safety Technicians","29-9012","Occupational Health and Safety Technicians"]
["(29-9091) Athletic Trainers","29-9091","Athletic Trainers"]
["(29-9092) Genetic Counselors","29-9092","Genetic Counselors"]
["(29-9099) Healthcare Practitioners and Technical Workers, All Other","29-9099","Healthcare Practitioners and Technical Workers, All Other"]
["(31-1011) Home Health Aides","31-1011","Home Health Aides"]
["(31-1013) Psychiatric Aides","31-1013","Psychiatric Aides"]
["(31-1014) Nursing Assistants","31-1014","Nursing Assistants"]
["(31-1015) Orderlies","31-1015","Orderlies"]
["(31-2011) Occupational Therapy Assistants","31-2011","Occupational Therapy Assistants"]
["(31-2012) Occupational Therapy Aides","31-2012","Occupational Therapy Aides"]
["(31-2021) Physical Therapist Assistants","31-2021","Physical Therapist Assistants"]
["(31-2022) Physical Therapist Aides","31-2022","Physical Therapist Aides"]
["(31-9011) Massage Therapists","31-9011","Massage Therapists"]
["(31-9091) Dental Assistants","31-9091","Dental Assistants"]
["(31-9092) Medical Assistants","31-9092","Medical Assistants"]
["(31-9093) Medical Equipment Preparers","31-9093","Medical Equipment Preparers"]
["(31-9094) Medical Transcriptionists","31-9094","Medical Transcriptionists"]
["(31-9095) Pharmacy Aides","31-9095","Pharmacy Aides"]
["(31-9096) Veterinary Assistants and Laboratory Animal Caretakers","31-9096","Veterinary Assistants and Laboratory Animal Caretakers"]
["(31-9097) Phlebotomists","31-9097","Phlebotomists"]
["(31-9099) Healthcare Support Workers, All Other","31-9099","Healthcare Support Workers, All Other"]
["(33-1011) First-Line Supervisors of Correctional Officers","33-1011","First-Line Supervisors of Correctional Officers"]
["(33-1012) First-Line Supervisors of Police and Detectives","33-1012","First-Line Supervisors of Police and Detectives"]
["(33-1021) First-Line Supervisors of Fire Fighting and Prevention Workers","33-1021","First-Line Supervisors of Fire Fighting and Prevention Workers"]
["(33-1099) First-Line Supervisors of Protective Service Workers, All Other","33-1099","First-Line Supervisors of Protective Service Workers, All Other"]
["(33-2011) Firefighters","33-2011","Firefighters"]
["(33-2021) Fire Inspectors and Investigators","33-2021","Fire Inspectors and Investigators"]
["(33-2022) Forest Fire Inspectors and Prevention Specialists","33-2022","Forest Fire Inspectors and Prevention Specialists"]
["(33-3011) Bailiffs","33-3011","Bailiffs"]
["(33-3012) Correctional Officers and Jailers","33-3012","Correctional Officers and Jailers"]
["(33-3021) Detectives and Criminal Investigators","33-3021","Detectives and Criminal Investigators"]
[{"$f":"CONCATENATE(\"(\",B388,\") \",C388)","v":"(33-3031) Fish and Game Wardens"},"33-3031","Fish and Game Wardens"]
["(33-3041) Parking Enforcement Workers","33-3041","Parking Enforcement Workers"]
["(33-3051) Police and Sheriff's Patrol Officers","33-3051","Police and Sheriff's Patrol Officers"]
["(33-3052) Transit and Railroad Police","33-3052","Transit and Railroad Police"]
["(33-9011) Animal Control Workers","33-9011","Animal Control Workers"]
["(33-9021) Private Detectives and Investigators","33-9021","Private Detectives and Investigators"]
["(33-9031) Gaming Surveillance Officers and Gaming Investigators","33-9031","Gaming Surveillance Officers and Gaming Investigators"]
["(33-9032) Security Guards","33-9032","Security Guards"]
["(33-9091) Crossing Guards","33-9091","Crossing Guards"]
["(33-9092) Lifeguards, Ski Patrol, and Other Recreational Protective Service Workers","33-9092","Lifeguards, Ski Patrol, and Other Recreational Protective Service Workers"]
["(33-9093) Transportation Security Screeners","33-9093","Transportation Security Screeners"]
["(33-9093 ) Transportation Security Screeners","33-9093 ","Transportation Security Screeners"]
["(33-9099) Protective Service Workers, All Other","33-9099","Protective Service Workers, All Other"]
["(35-1011) Chefs and Head Cooks","35-1011","Chefs and Head Cooks"]
["(35-1012) First-Line Supervisors of Food Preparation and Serving Workers","35-1012","First-Line Supervisors of Food Preparation and Serving Workers"]
["(35-2011) Cooks, Fast Food","35-2011","Cooks, Fast Food"]
["(35-2012) Cooks, Institution and Cafeteria","35-2012","Cooks, Institution and Cafeteria"]
["(35-2013) Cooks, Private Household","35-2013","Cooks, Private Household"]
["(35-2014) Cooks, Restaurant","35-2014","Cooks, Restaurant"]
["(35-2015) Cooks, Short Order","35-2015","Cooks, Short Order"]
["(35-2019) Cooks, All Other","35-2019","Cooks, All Other"]
["(35-2021) Food Preparation Workers","35-2021","Food Preparation Workers"]
["(35-3011) Bartenders","35-3011","Bartenders"]
["(35-3021) Combined Food Preparation and Serving Workers, Including Fast Food","35-3021","Combined Food Preparation and Serving Workers, Including Fast Food"]
["(35-3022) Counter Attendants, Cafeteria, Food Concession, and Coffee Shop","35-3022","Counter Attendants, Cafeteria, Food Concession, and Coffee Shop"]
["(35-3031) Waiters and Waitresses","35-3031","Waiters and Waitresses"]
["(35-3041) Food Servers, Nonrestaurant","35-3041","Food Servers, Nonrestaurant"]
["(35-9011) Dining Room and Cafeteria Attendants and Bartender Helpers","35-9011","Dining Room and Cafeteria Attendants and Bartender Helpers"]
["(35-9021) Dishwashers","35-9021","Dishwashers"]
["(35-9031) Hosts and Hostesses, Restaurant, Lounge, and Coffee Shop","35-9031","Hosts and Hostesses, Restaurant, Lounge, and Coffee Shop"]
["(35-9099) Food Preparation and Serving Related Workers, All Other","35-9099","Food Preparation and Serving Related Workers, All Other"]
["(37-1011) First-Line Supervisors of Housekeeping and Janitorial Workers","37-1011","First-Line Supervisors of Housekeeping and Janitorial Workers"]
["(37-1012) First-Line Supervisors of Landscaping, Lawn Service, and Groundskeeping Workers","37-1012","First-Line Supervisors of Landscaping, Lawn Service, and Groundskeeping Workers"]
["(37-2011) Janitors and Cleaners, Except Maids and Housekeeping Cleaners","37-2011","Janitors and Cleaners, Except Maids and Housekeeping Cleaners"]
["(37-2012) Maids and Housekeeping Cleaners","37-2012","Maids and Housekeeping Cleaners"]
["(37-2019) Building Cleaning Workers, All Other","37-2019","Building Cleaning Workers, All Other"]
["(37-2021) Pest Control Workers","37-2021","Pest Control Workers"]
["(37-3011) Landscaping and Groundskeeping Workers","37-3011","Landscaping and Groundskeeping Workers"]
["(37-3012) Pesticide Handlers, Sprayers, and Applicators, Vegetation","37-3012","Pesticide Handlers, Sprayers, and Applicators, Vegetation"]
["(37-3013) Tree Trimmers and Pruners","37-3013","Tree Trimmers and Pruners"]
["(37-3019) Grounds Maintenance Workers, All Other","37-3019","Grounds Maintenance Workers, All Other"]
["(39-1011) Gaming Supervisors","39-1011","Gaming Supervisors"]
["(39-1012) Slot Supervisors","39-1012","Slot Supervisors"]
["(39-1021) First-Line Supervisors of Personal Service Workers","39-1021","First-Line Supervisors of Personal Service Workers"]
["(39-2011) Animal Trainers","39-2011","Animal Trainers"]
["(39-2021) Nonfarm Animal Caretakers","39-2021","Nonfarm Animal Caretakers"]
["(39-3011) Gaming Dealers","39-3011","Gaming Dealers"]
["(39-3012) Gaming and Sports Book Writers and Runners","39-3012","Gaming and Sports Book Writers and Runners"]
["(39-3019) Gaming Service Workers, All Other","39-3019","Gaming Service Workers, All Other"]
["(39-3021) Motion Picture Projectionists","39-3021","Motion Picture Projectionists"]
["(39-3031) Ushers, Lobby Attendants, and Ticket Takers","39-3031","Ushers, Lobby Attendants, and Ticket Takers"]
["(39-3091) Amusement and Recreation Attendants","39-3091","Amusement and Recreation Attendants"]
["(39-3092) Costume Attendants","39-3092","Costume Attendants"]
["(39-3093) Locker Room, Coatroom, and Dressing Room Attendants","39-3093","Locker Room, Coatroom, and Dressing Room Attendants"]
["(39-3099) Entertainment Attendants and Related Workers, All Other","39-3099","Entertainment Attendants and Related Workers, All Other"]
["(39-4011) Embalmers","39-4011","Embalmers"]
["(39-4021) Funeral Attendants","39-4021","Funeral Attendants"]
["(39-4031) Morticians, Undertakers, and Funeral Directors","39-4031","Morticians, Undertakers, and Funeral Directors"]
["(39-5011) Barbers","39-5011","Barbers"]
["(39-5012) Hairdressers, Hairstylists, and Cosmetologists","39-5012","Hairdressers, Hairstylists, and Cosmetologists"]
["(39-5091) Makeup Artists, Theatrical and Performance","39-5091","Makeup Artists, Theatrical and Performance"]
["(39-5092) Manicurists and Pedicurists","39-5092","Manicurists and Pedicurists"]
["(39-5093) Shampooers","39-5093","Shampooers"]
["(39-5094) Skincare Specialists","39-5094","Skincare Specialists"]
[{"$f":"CONCATENATE(\"(\",B452,\") \",C452)","v":"(39-6011) Baggage Porters and Bellhops"},"39-6011","Baggage Porters and Bellhops"]
["(39-6012) Concierges","39-6012","Concierges"]
["(39-7011) Tour Guides and Escorts","39-7011","Tour Guides and Escorts"]
["(39-7012) Travel Guides","39-7012","Travel Guides"]
["(39-9011) Childcare Workers","39-9011","Childcare Workers"]
["(39-9021) Personal Care Aides","39-9021","Personal Care Aides"]
["(39-9031) Fitness Trainers and Aerobics Instructors","39-9031","Fitness Trainers and Aerobics Instructors"]
["(39-9032) Recreation Workers","39-9032","Recreation Workers"]
["(39-9041) Residential Advisors","39-9041","Residential Advisors"]
["(39-9099) Personal Care and Service Workers, All Other","39-9099","Personal Care and Service Workers, All Other"]
["(41-1011) First-Line Supervisors of Retail Sales Workers","41-1011","First-Line Supervisors of Retail Sales Workers"]
["(41-1012) First-Line Supervisors of Non-Retail Sales Workers","41-1012","First-Line Supervisors of Non-Retail Sales Workers"]
["(41-2011) Cashiers","41-2011","Cashiers"]
["(41-2012) Gaming Change Persons and Booth Cashiers","41-2012","Gaming Change Persons and Booth Cashiers"]
["(41-2021) Counter and Rental Clerks","41-2021","Counter and Rental Clerks"]
["(41-2022) Parts Salespersons","41-2022","Parts Salespersons"]
["(41-2031) Retail Salespersons","41-2031","Retail Salespersons"]
["(41-3011) Advertising Sales Agents","41-3011","Advertising Sales Agents"]
["(41-3021) Insurance Sales Agents","41-3021","Insurance Sales Agents"]
["(41-3031) Securities, Commodities, and Financial Services Sales Agents","41-3031","Securities, Commodities, and Financial Services Sales Agents"]
["(41-3041) Travel Agents","41-3041","Travel Agents"]
["(41-3099) Sales Representatives, Services, All Other","41-3099","Sales Representatives, Services, All Other"]
["(41-4011) Sales Representatives, Wholesale and Manufacturing, Technical and Scientific Products","41-4011","Sales Representatives, Wholesale and Manufacturing, Technical and Scientific Products"]
["(41-4012) Sales Representatives, Wholesale and Manufacturing, Except Technical and Scientific Products","41-4012","Sales Representatives, Wholesale and Manufacturing, Except Technical and Scientific Products"]
["(41-9011) Demonstrators and Product Promoters","41-9011","Demonstrators and Product Promoters"]
["(41-9012) Models","41-9012","Models"]
["(41-9021) Real Estate Brokers","41-9021","Real Estate Brokers"]
["(41-9022) Real Estate Sales Agents","41-9022","Real Estate Sales Agents"]
["(41-9031) Sales Engineers","41-9031","Sales Engineers"]
["(41-9041) Telemarketers","41-9041","Telemarketers"]
["(41-9091) Door-to-Door Sales Workers, News and Street Vendors, and Related Workers","41-9091","Door-to-Door Sales Workers, News and Street Vendors, and Related Workers"]
["(41-9099) Sales and Related Workers, All Other","41-9099","Sales and Related Workers, All Other"]
["(43-1011) First-Line Supervisors of Office and Administrative Support Workers","43-1011","First-Line Supervisors of Office and Administrative Support Workers"]
["(43-2011) Switchboard Operators, Including Answering Service","43-2011","Switchboard Operators, Including Answering Service"]
["(43-2021) Telephone Operators","43-2021","Telephone Operators"]
["(43-2099) Communications Equipment Operators, All Other","43-2099","Communications Equipment Operators, All Other"]
["(43-3011) Bill and Account Collectors","43-3011","Bill and Account Collectors"]
["(43-3021) Billing and Posting Clerks","43-3021","Billing and Posting Clerks"]
["(43-3031) Bookkeeping, Accounting, and Auditing Clerks","43-3031","Bookkeeping, Accounting, and Auditing Clerks"]
["(43-3041) Gaming Cage Workers","43-3041","Gaming Cage Workers"]
["(43-3051) Payroll and Timekeeping Clerks","43-3051","Payroll and Timekeeping Clerks"]
["(43-3061) Procurement Clerks","43-3061","Procurement Clerks"]
["(43-3071) Tellers","43-3071","Tellers"]
["(43-3099) Financial Clerks, All Other","43-3099","Financial Clerks, All Other"]
["(43-4011) Brokerage Clerks","43-4011","Brokerage Clerks"]
["(43-4021) Correspondence Clerks","43-4021","Correspondence Clerks"]
["(43-4031) Court, Municipal, and License Clerks","43-4031","Court, Municipal, and License Clerks"]
["(43-4041) Credit Authorizers, Checkers, and Clerks","43-4041","Credit Authorizers, Checkers, and Clerks"]
["(43-4051) Customer Service Representatives","43-4051","Customer Service Representatives"]
["(43-4061) Eligibility Interviewers, Government Programs","43-4061","Eligibility Interviewers, Government Programs"]
["(43-4071) File Clerks","43-4071","File Clerks"]
["(43-4081) Hotel, Motel, and Resort Desk Clerks","43-4081","Hotel, Motel, and Resort Desk Clerks"]
["(43-4111) Interviewers, Except Eligibility and Loan","43-4111","Interviewers, Except Eligibility and Loan"]
["(43-4121) Library Assistants, Clerical","43-4121","Library Assistants, Clerical"]
["(43-4131) Loan Interviewers and Clerks","43-4131","Loan Interviewers and Clerks"]
["(43-4141) New Accounts Clerks","43-4141","New Accounts Clerks"]
["(43-4151) Order Clerks","43-4151","Order Clerks"]
["(43-4161) Human Resources Assistants, Except Payroll and Timekeeping","43-4161","Human Resources Assistants, Except Payroll and Timekeeping"]
["(43-4171) Receptionists and Information Clerks","43-4171","Receptionists and Information Clerks"]
["(43-4181) Reservation and Transportation Ticket Agents and Travel Clerks","43-4181","Reservation and Transportation Ticket Agents and Travel Clerks"]
["(43-4199) Information and Record Clerks, All Other","43-4199","Information and Record Clerks, All Other"]
["(43-5011) Cargo and Freight Agents","43-5011","Cargo and Freight Agents"]
["(43-5021) Couriers and Messengers","43-5021","Couriers and Messengers"]
["(43-5031) Police, Fire, and Ambulance Dispatchers","43-5031","Police, Fire, and Ambulance Dispatchers"]
[{"$f":"CONCATENATE(\"(\",B516,\") \",C516)","v":"(43-5032) Dispatchers, Except Police, Fire, and Ambulance"},"43-5032","Dispatchers, Except Police, Fire, and Ambulance"]
["(43-5041) Meter Readers, Utilities","43-5041","Meter Readers, Utilities"]
["(43-5051) Postal Service Clerks","43-5051","Postal Service Clerks"]
["(43-5052) Postal Service Mail Carriers","43-5052","Postal Service Mail Carriers"]
["(43-5053) Postal Service Mail Sorters, Processors, and Processing Machine Operators","43-5053","Postal Service Mail Sorters, Processors, and Processing Machine Operators"]
["(43-5061) Production, Planning, and Expediting Clerks","43-5061","Production, Planning, and Expediting Clerks"]
["(43-5071) Shipping, Receiving, and Traffic Clerks","43-5071","Shipping, Receiving, and Traffic Clerks"]
["(43-5081) Stock Clerks and Order Fillers","43-5081","Stock Clerks and Order Fillers"]
["(43-5111) Weighers, Measurers, Checkers, and Samplers, Recordkeeping","43-5111","Weighers, Measurers, Checkers, and Samplers, Recordkeeping"]
["(43-6011) Executive Secretaries and Executive Administrative Assistants","43-6011","Executive Secretaries and Executive Administrative Assistants"]
["(43-6012) Legal Secretaries","43-6012","Legal Secretaries"]
["(43-6013) Medical Secretaries","43-6013","Medical Secretaries"]
["(43-6014) Secretaries and Administrative Assistants, Except Legal, Medical, and Executive","43-6014","Secretaries and Administrative Assistants, Except Legal, Medical, and Executive"]
["(43-9011) Computer Operators","43-9011","Computer Operators"]
["(43-9021) Data Entry Keyers","43-9021","Data Entry Keyers"]
["(43-9022) Word Processors and Typists","43-9022","Word Processors and Typists"]
["(43-9031) Desktop Publishers","43-9031","Desktop Publishers"]
["(43-9041) Insurance Claims and Policy Processing Clerks","43-9041","Insurance Claims and Policy Processing Clerks"]
["(43-9051) Mail Clerks and Mail Machine Operators, Except Postal Service","43-9051","Mail Clerks and Mail Machine Operators, Except Postal Service"]
["(43-9061) Office Clerks, General","43-9061","Office Clerks, General"]
["(43-9071) Office Machine Operators, Except Computer","43-9071","Office Machine Operators, Except Computer"]
["(43-9081) Proofreaders and Copy Markers","43-9081","Proofreaders and Copy Markers"]
["(43-9111) Statistical Assistants","43-9111","Statistical Assistants"]
["(43-9199) Office and Administrative Support Workers, All Other","43-9199","Office and Administrative Support Workers, All Other"]
["(45-1011) First-Line Supervisors of Farming, Fishing, and Forestry Workers","45-1011","First-Line Supervisors of Farming, Fishing, and Forestry Workers"]
["(45-2011) Agricultural Inspectors","45-2011","Agricultural Inspectors"]
["(45-2021) Animal Breeders","45-2021","Animal Breeders"]
["(45-2041) Graders and Sorters, Agricultural Products","45-2041","Graders and Sorters, Agricultural Products"]
["(45-2091) Agricultural Equipment Operators","45-2091","Agricultural Equipment Operators"]
["(45-2092) Farmworkers and Laborers, Crop, Nursery, and Greenhouse","45-2092","Farmworkers and Laborers, Crop, Nursery, and Greenhouse"]
["(45-2093) Farmworkers, Farm, Ranch, and Aquacultural Animals","45-2093","Farmworkers, Farm, Ranch, and Aquacultural Animals"]
["(45-2099) Agricultural Workers, All Other","45-2099","Agricultural Workers, All Other"]
["(45-3011) Fishers and Related Fishing Workers","45-3011","Fishers and Related Fishing Workers"]
["(45-3021) Hunters and Trappers","45-3021","Hunters and Trappers"]
["(45-4011) Forest and Conservation Workers","45-4011","Forest and Conservation Workers"]
["(45-4021) Fallers","45-4021","Fallers"]
["(45-4022) Logging Equipment Operators","45-4022","Logging Equipment Operators"]
["(45-4023) Log Graders and Scalers","45-4023","Log Graders and Scalers"]
["(45-4029) Logging Workers, All Other","45-4029","Logging Workers, All Other"]
["(47-1011) First-Line Supervisors of Construction Trades and Extraction Workers","47-1011","First-Line Supervisors of Construction Trades and Extraction Workers"]
["(47-2011) Boilermakers","47-2011","Boilermakers"]
["(47-2021) Brickmasons and Blockmasons","47-2021","Brickmasons and Blockmasons"]
["(47-2022) Stonemasons","47-2022","Stonemasons"]
["(47-2031) Carpenters","47-2031","Carpenters"]
["(47-2041) Carpet Installers","47-2041","Carpet Installers"]
["(47-2042) Floor Layers, Except Carpet, Wood, and Hard Tiles","47-2042","Floor Layers, Except Carpet, Wood, and Hard Tiles"]
["(47-2043) Floor Sanders and Finishers","47-2043","Floor Sanders and Finishers"]
["(47-2044) Tile and Marble Setters","47-2044","Tile and Marble Setters"]
["(47-2051) Cement Masons and Concrete Finishers","47-2051","Cement Masons and Concrete Finishers"]
["(47-2053) Terrazzo Workers and Finishers","47-2053","Terrazzo Workers and Finishers"]
["(47-2061) Construction Laborers","47-2061","Construction Laborers"]
["(47-2071) Paving, Surfacing, and Tamping Equipment Operators","47-2071","Paving, Surfacing, and Tamping Equipment Operators"]
["(47-2072) Pile-Driver Operators","47-2072","Pile-Driver Operators"]
["(47-2073) Operating Engineers and Other Construction Equipment Operators","47-2073","Operating Engineers and Other Construction Equipment Operators"]
["(47-2081) Drywall and Ceiling Tile Installers","47-2081","Drywall and Ceiling Tile Installers"]
["(47-2082) Tapers","47-2082","Tapers"]
["(47-2111) Electricians","47-2111","Electricians"]
["(47-2121) Glaziers","47-2121","Glaziers"]
["(47-2131) Insulation Workers, Floor, Ceiling, and Wall","47-2131","Insulation Workers, Floor, Ceiling, and Wall"]
["(47-2132) Insulation Workers, Mechanical","47-2132","Insulation Workers, Mechanical"]
["(47-2141) Painters, Construction and Maintenance","47-2141","Painters, Construction and Maintenance"]
["(47-2142) Paperhangers","47-2142","Paperhangers"]
["(47-2151) Pipelayers","47-2151","Pipelayers"]
["(47-2152) Plumbers, Pipefitters, and Steamfitters","47-2152","Plumbers, Pipefitters, and Steamfitters"]
[{"$f":"CONCATENATE(\"(\",B580,\") \",C580)","v":"(47-2161) Plasterers and Stucco Masons"},"47-2161","Plasterers and Stucco Masons"]
["(47-2171) Reinforcing Iron and Rebar Workers","47-2171","Reinforcing Iron and Rebar Workers"]
["(47-2181) Roofers","47-2181","Roofers"]
["(47-2211) Sheet Metal Workers","47-2211","Sheet Metal Workers"]
["(47-2221) Structural Iron and Steel Workers","47-2221","Structural Iron and Steel Workers"]
["(47-2231) Solar Photovoltaic Installers","47-2231","Solar Photovoltaic Installers"]
["(47-3011) Helpers--Brickmasons, Blockmasons, Stonemasons, and Tile and Marble Setters","47-3011","Helpers--Brickmasons, Blockmasons, Stonemasons, and Tile and Marble Setters"]
["(47-3012) Helpers--Carpenters","47-3012","Helpers--Carpenters"]
["(47-3013) Helpers--Electricians","47-3013","Helpers--Electricians"]
["(47-3014) Helpers--Painters, Paperhangers, Plasterers, and Stucco Masons","47-3014","Helpers--Painters, Paperhangers, Plasterers, and Stucco Masons"]
["(47-3015) Helpers--Pipelayers, Plumbers, Pipefitters, and Steamfitters","47-3015","Helpers--Pipelayers, Plumbers, Pipefitters, and Steamfitters"]
["(47-3016) Helpers--Roofers","47-3016","Helpers--Roofers"]
["(47-3019) Helpers, Construction Trades, All Other","47-3019","Helpers, Construction Trades, All Other"]
["(47-4011) Construction and Building Inspectors","47-4011","Construction and Building Inspectors"]
["(47-4021) Elevator Installers and Repairers","47-4021","Elevator Installers and Repairers"]
["(47-4031) Fence Erectors","47-4031","Fence Erectors"]
["(47-4041) Hazardous Materials Removal Workers","47-4041","Hazardous Materials Removal Workers"]
["(47-4051) Highway Maintenance Workers","47-4051","Highway Maintenance Workers"]
["(47-4061) Rail-Track Laying and Maintenance Equipment Operators","47-4061","Rail-Track Laying and Maintenance Equipment Operators"]
["(47-4071) Septic Tank Servicers and Sewer Pipe Cleaners","47-4071","Septic Tank Servicers and Sewer Pipe Cleaners"]
["(47-4091) Segmental Pavers","47-4091","Segmental Pavers"]
["(47-4099) Construction and Related Workers, All Other","47-4099","Construction and Related Workers, All Other"]
["(47-5011) Derrick Operators, Oil and Gas","47-5011","Derrick Operators, Oil and Gas"]
["(47-5012) Rotary Drill Operators, Oil and Gas","47-5012","Rotary Drill Operators, Oil and Gas"]
["(47-5013) Service Unit Operators, Oil, Gas, and Mining","47-5013","Service Unit Operators, Oil, Gas, and Mining"]
["(47-5021) Earth Drillers, Except Oil and Gas","47-5021","Earth Drillers, Except Oil and Gas"]
["(47-5031) Explosives Workers, Ordnance Handling Experts, and Blasters","47-5031","Explosives Workers, Ordnance Handling Experts, and Blasters"]
["(47-5041) Continuous Mining Machine Operators","47-5041","Continuous Mining Machine Operators"]
["(47-5042) Mine Cutting and Channeling Machine Operators","47-5042","Mine Cutting and Channeling Machine Operators"]
["(47-5049) Mining Machine Operators, All Other","47-5049","Mining Machine Operators, All Other"]
["(47-5051) Rock Splitters, Quarry","47-5051","Rock Splitters, Quarry"]
["(47-5061) Roof Bolters, Mining","47-5061","Roof Bolters, Mining"]
["(47-5071) Roustabouts, Oil and Gas","47-5071","Roustabouts, Oil and Gas"]
["(47-5081) Helpers--Extraction Workers","47-5081","Helpers--Extraction Workers"]
["(47-5099) Extraction Workers, All Other","47-5099","Extraction Workers, All Other"]
["(49-1011) First-Line Supervisors of Mechanics, Installers, and Repairers","49-1011","First-Line Supervisors of Mechanics, Installers, and Repairers"]
["(49-2011) Computer, Automated Teller, and Office Machine Repairers","49-2011","Computer, Automated Teller, and Office Machine Repairers"]
["(49-2021) Radio, Cellular, and Tower Equipment Installers and Repairers","49-2021","Radio, Cellular, and Tower Equipment Installers and Repairers"]
["(49-2022) Telecommunications Equipment Installers and Repairers, Except Line Installers","49-2022","Telecommunications Equipment Installers and Repairers, Except Line Installers"]
["(49-2091) Avionics Technicians","49-2091","Avionics Technicians"]
["(49-2092) Electric Motor, Power Tool, and Related Repairers","49-2092","Electric Motor, Power Tool, and Related Repairers"]
["(49-2093) Electrical and Electronics Installers and Repairers, Transportation Equipment","49-2093","Electrical and Electronics Installers and Repairers, Transportation Equipment"]
["(49-2094) Electrical and Electronics Repairers, Commercial and Industrial Equipment","49-2094","Electrical and Electronics Repairers, Commercial and Industrial Equipment"]
["(49-2095) Electrical and Electronics Repairers, Powerhouse, Substation, and Relay","49-2095","Electrical and Electronics Repairers, Powerhouse, Substation, and Relay"]
["(49-2095) Electrical and Electronics Repairers, Commercial and Industrial Equipment","49-2095","Electrical and Electronics Repairers, Commercial and Industrial Equipment"]
["(49-2096) Electronic Equipment Installers and Repairers, Motor Vehicles","49-2096","Electronic Equipment Installers and Repairers, Motor Vehicles"]
["(49-2097) Electronic Home Entertainment Equipment Installers and Repairers","49-2097","Electronic Home Entertainment Equipment Installers and Repairers"]
["(49-2098) Security and Fire Alarm Systems Installers","49-2098","Security and Fire Alarm Systems Installers"]
["(49-3011) Aircraft Mechanics and Service Technicians","49-3011","Aircraft Mechanics and Service Technicians"]
["(49-3021) Automotive Body and Related Repairers","49-3021","Automotive Body and Related Repairers"]
["(49-3022) Automotive Glass Installers and Repairers","49-3022","Automotive Glass Installers and Repairers"]
["(49-3023) Automotive Service Technicians and Mechanics","49-3023","Automotive Service Technicians and Mechanics"]
["(49-3031) Bus and Truck Mechanics and Diesel Engine Specialists","49-3031","Bus and Truck Mechanics and Diesel Engine Specialists"]
["(49-3041) Farm Equipment Mechanics and Service Technicians","49-3041","Farm Equipment Mechanics and Service Technicians"]
["(49-3042) Mobile Heavy Equipment Mechanics, Except Engines","49-3042","Mobile Heavy Equipment Mechanics, Except Engines"]
["(49-3043) Rail Car Repairers","49-3043","Rail Car Repairers"]
["(49-3051) Motorboat Mechanics and Service Technicians","49-3051","Motorboat Mechanics and Service Technicians"]
["(49-3052) Motorcycle Mechanics","49-3052","Motorcycle Mechanics"]
["(49-3053) Outdoor Power Equipment and Other Small Engine Mechanics","49-3053","Outdoor Power Equipment and Other Small Engine Mechanics"]
["(49-3091) Bicycle Repairers","49-3091","Bicycle Repairers"]
["(49-3092) Recreational Vehicle Service Technicians","49-3092","Recreational Vehicle Service Technicians"]
["(49-3093) Tire Repairers and Changers","49-3093","Tire Repairers and Changers"]
["(49-9011) Mechanical Door Repairers","49-9011","Mechanical Door Repairers"]
["(49-9012) Control and Valve Installers and Repairers, Except Mechanical Door","49-9012","Control and Valve Installers and Repairers, Except Mechanical Door"]
[{"$f":"CONCATENATE(\"(\",B644,\") \",C644)","v":"(49-9021) Heating, Air Conditioning, and Refrigeration Mechanics and Installers"},"49-9021","Heating, Air Conditioning, and Refrigeration Mechanics and Installers"]
["(49-9031) Home Appliance Repairers","49-9031","Home Appliance Repairers"]
["(49-9041) Industrial Machinery Mechanics","49-9041","Industrial Machinery Mechanics"]
["(49-9043) Maintenance Workers, Machinery","49-9043","Maintenance Workers, Machinery"]
["(49-9044) Millwrights","49-9044","Millwrights"]
["(49-9045) Refractory Materials Repairers, Except Brickmasons","49-9045","Refractory Materials Repairers, Except Brickmasons"]
["(49-9051) Electrical Power-Line Installers and Repairers","49-9051","Electrical Power-Line Installers and Repairers"]
["(49-9052) Telecommunications Line Installers and Repairers","49-9052","Telecommunications Line Installers and Repairers"]
["(49-9061) Camera and Photographic Equipment Repairers","49-9061","Camera and Photographic Equipment Repairers"]
["(49-9062) Medical Equipment Repairers","49-9062","Medical Equipment Repairers"]
["(49-9063) Musical Instrument Repairers and Tuners","49-9063","Musical Instrument Repairers and Tuners"]
["(49-9064) Watch Repairers","49-9064","Watch Repairers"]
["(49-9069) Precision Instrument and Equipment Repairers, All Other","49-9069","Precision Instrument and Equipment Repairers, All Other"]
["(49-9071) Maintenance and Repair Workers, General","49-9071","Maintenance and Repair Workers, General"]
["(49-9081) Wind Turbine Service Technicians","49-9081","Wind Turbine Service Technicians"]
["(49-9091) Coin, Vending, and Amusement Machine Servicers and Repairers","49-9091","Coin, Vending, and Amusement Machine Servicers and Repairers"]
["(49-9092) Commercial Divers","49-9092","Commercial Divers"]
["(49-9093) Fabric Menders, Except Garment","49-9093","Fabric Menders, Except Garment"]
["(49-9094) Locksmiths and Safe Repairers","49-9094","Locksmiths and Safe Repairers"]
["(49-9095) Manufactured Building and Mobile Home Installers","49-9095","Manufactured Building and Mobile Home Installers"]
["(49-9096) Riggers","49-9096","Riggers"]
["(49-9097) Signal and Track Switch Repairers","49-9097","Signal and Track Switch Repairers"]
["(49-9098) Helpers--Installation, Maintenance, and Repair Workers","49-9098","Helpers--Installation, Maintenance, and Repair Workers"]
["(49-9099) Installation, Maintenance, and Repair Workers, All Other","49-9099","Installation, Maintenance, and Repair Workers, All Other"]
["(51-1011) First-Line Supervisors of Production and Operating Workers","51-1011","First-Line Supervisors of Production and Operating Workers"]
["(51-2011) Aircraft Structure, Surfaces, Rigging, and Systems Assemblers","51-2011","Aircraft Structure, Surfaces, Rigging, and Systems Assemblers"]
["(51-2011) Aircraft Structure, Surfaces, Rigging, and Systems Assembler","51-2011","Aircraft Structure, Surfaces, Rigging, and Systems Assembler"]
["(51-2021) Coil Winders, Tapers, and Finishers","51-2021","Coil Winders, Tapers, and Finishers"]
["(51-2022) Electrical and Electronic Equipment Assemblers","51-2022","Electrical and Electronic Equipment Assemblers"]
["(51-2023) Electromechanical Equipment Assemblers","51-2023","Electromechanical Equipment Assemblers"]
["(51-2031) Engine and Other Machine Assemblers","51-2031","Engine and Other Machine Assemblers"]
["(51-2041) Structural Metal Fabricators and Fitters","51-2041","Structural Metal Fabricators and Fitters"]
["(51-2091) Fiberglass Laminators and Fabricators","51-2091","Fiberglass Laminators and Fabricators"]
["(51-2092) Team Assemblers","51-2092","Team Assemblers"]
["(51-2093) Timing Device Assemblers and Adjusters","51-2093","Timing Device Assemblers and Adjusters"]
["(51-2099) Assemblers and Fabricators, All Other","51-2099","Assemblers and Fabricators, All Other"]
["(51-3011) Bakers","51-3011","Bakers"]
["(51-3021) Butchers and Meat Cutters","51-3021","Butchers and Meat Cutters"]
["(51-3022) Meat, Poultry, and Fish Cutters and Trimmers","51-3022","Meat, Poultry, and Fish Cutters and Trimmers"]
["(51-3023) Slaughterers and Meat Packers","51-3023","Slaughterers and Meat Packers"]
["(51-3091) Food and Tobacco Roasting, Baking, and Drying Machine Operators and Tenders","51-3091","Food and Tobacco Roasting, Baking, and Drying Machine Operators and Tenders"]
["(51-3092) Food Batchmakers","51-3092","Food Batchmakers"]
["(51-3093) Food Cooking Machine Operators and Tenders","51-3093","Food Cooking Machine Operators and Tenders"]
["(51-3099) Food Processing Workers, All Other","51-3099","Food Processing Workers, All Other"]
["(51-4011) Computer-Controlled Machine Tool Operators, Metal and Plastic","51-4011","Computer-Controlled Machine Tool Operators, Metal and Plastic"]
["(51-4012) Computer Numerically Controlled Machine Tool Programmers, Metal and Plastic","51-4012","Computer Numerically Controlled Machine Tool Programmers, Metal and Plastic"]
["(51-4021) Extruding and Drawing Machine Setters, Operators, and Tenders, Metal and Plastic","51-4021","Extruding and Drawing Machine Setters, Operators, and Tenders, Metal and Plastic"]
["(51-4022) Forging Machine Setters, Operators, and Tenders, Metal and Plastic","51-4022","Forging Machine Setters, Operators, and Tenders, Metal and Plastic"]
["(51-4023) Rolling Machine Setters, Operators, and Tenders, Metal and Plastic","51-4023","Rolling Machine Setters, Operators, and Tenders, Metal and Plastic"]
["(51-4031) Cutting, Punching, and Press Machine Setters, Operators, and Tenders, Metal and Plastic","51-4031","Cutting, Punching, and Press Machine Setters, Operators, and Tenders, Metal and Plastic"]
["(51-4032) Drilling and Boring Machine Tool Setters, Operators, and Tenders, Metal and Plastic","51-4032","Drilling and Boring Machine Tool Setters, Operators, and Tenders, Metal and Plastic"]
["(51-4033) Grinding, Lapping, Polishing, and Buffing Machine Tool Setters, Operators, and Tenders, Metal and Plastic","51-4033","Grinding, Lapping, Polishing, and Buffing Machine Tool Setters, Operators, and Tenders, Metal and Plastic"]
["(51-4034) Lathe and Turning Machine Tool Setters, Operators, and Tenders, Metal and Plastic","51-4034","Lathe and Turning Machine Tool Setters, Operators, and Tenders, Metal and Plastic"]
["(51-4035) Milling and Planing Machine Setters, Operators, and Tenders, Metal and Plastic","51-4035","Milling and Planing Machine Setters, Operators, and Tenders, Metal and Plastic"]
["(51-4041) Machinists","51-4041","Machinists"]
["(51-4051) Metal-Refining Furnace Operators and Tenders","51-4051","Metal-Refining Furnace Operators and Tenders"]
["(51-4052) Pourers and Casters, Metal","51-4052","Pourers and Casters, Metal"]
["(51-4061) Model Makers, Metal and Plastic","51-4061","Model Makers, Metal and Plastic"]
["(51-4062) Patternmakers, Metal and Plastic","51-4062","Patternmakers, Metal and Plastic"]
["(51-4071) Foundry Mold and Coremakers","51-4071","Foundry Mold and Coremakers"]
["(51-4072) Molding, Coremaking, and Casting Machine Setters, Operators, and Tenders, Metal and Plastic","51-4072","Molding, Coremaking, and Casting Machine Setters, Operators, and Tenders, Metal and Plastic"]
["(51-4081) Multiple Machine Tool Setters, Operators, and Tenders, Metal and Plastic","51-4081","Multiple Machine Tool Setters, Operators, and Tenders, Metal and Plastic"]
["(51-4111) Tool and Die Makers","51-4111","Tool and Die Makers"]
["(51-4121) Welders, Cutters, Solderers, and Brazers","51-4121","Welders, Cutters, Solderers, and Brazers"]
[{"$f":"CONCATENATE(\"(\",B708,\") \",C708)","v":"(51-4122) Welding, Soldering, and Brazing Machine Setters, Operators, and Tenders"},"51-4122","Welding, Soldering, and Brazing Machine Setters, Operators, and Tenders"]
["(51-4191) Heat Treating Equipment Setters, Operators, and Tenders, Metal and Plastic","51-4191","Heat Treating Equipment Setters, Operators, and Tenders, Metal and Plastic"]
["(51-4192) Layout Workers, Metal and Plastic","51-4192","Layout Workers, Metal and Plastic"]
["(51-4193) Plating and Coating Machine Setters, Operators, and Tenders, Metal and Plastic","51-4193","Plating and Coating Machine Setters, Operators, and Tenders, Metal and Plastic"]
["(51-4194) Tool Grinders, Filers, and Sharpeners","51-4194","Tool Grinders, Filers, and Sharpeners"]
["(51-4199) Metal Workers and Plastic Workers, All Other","51-4199","Metal Workers and Plastic Workers, All Other"]
["(51-5111) Prepress Technicians and Workers","51-5111","Prepress Technicians and Workers"]
["(51-5112) Printing Press Operators","51-5112","Printing Press Operators"]
["(51-5113) Print Binding and Finishing Workers","51-5113","Print Binding and Finishing Workers"]
["(51-6011) Laundry and Dry-Cleaning Workers","51-6011","Laundry and Dry-Cleaning Workers"]
["(51-6021) Pressers, Textile, Garment, and Related Materials","51-6021","Pressers, Textile, Garment, and Related Materials"]
["(51-6031) Sewing Machine Operators","51-6031","Sewing Machine Operators"]
["(51-6041) Shoe and Leather Workers and Repairers","51-6041","Shoe and Leather Workers and Repairers"]
["(51-6042) Shoe Machine Operators and Tenders","51-6042","Shoe Machine Operators and Tenders"]
["(51-6051) Sewers, Hand","51-6051","Sewers, Hand"]
["(51-6052) Tailors, Dressmakers, and Custom Sewers","51-6052","Tailors, Dressmakers, and Custom Sewers"]
["(51-6061) Textile Bleaching and Dyeing Machine Operators and Tenders","51-6061","Textile Bleaching and Dyeing Machine Operators and Tenders"]
["(51-6062) Textile Cutting Machine Setters, Operators, and Tenders","51-6062","Textile Cutting Machine Setters, Operators, and Tenders"]
["(51-6063) Textile Knitting and Weaving Machine Setters, Operators, and Tenders","51-6063","Textile Knitting and Weaving Machine Setters, Operators, and Tenders"]
["(51-6064) Textile Winding, Twisting, and Drawing Out Machine Setters, Operators, and Tenders","51-6064","Textile Winding, Twisting, and Drawing Out Machine Setters, Operators, and Tenders"]
["(51-6091) Extruding and Forming Machine Setters, Operators, and Tenders, Synthetic and Glass Fibers","51-6091","Extruding and Forming Machine Setters, Operators, and Tenders, Synthetic and Glass Fibers"]
["(51-6092) Fabric and Apparel Patternmakers","51-6092","Fabric and Apparel Patternmakers"]
["(51-6093) Upholsterers","51-6093","Upholsterers"]
["(51-6099) Textile, Apparel, and Furnishings Workers, All Other","51-6099","Textile, Apparel, and Furnishings Workers, All Other"]
["(51-7011) Cabinetmakers and Bench Carpenters","51-7011","Cabinetmakers and Bench Carpenters"]
["(51-7021) Furniture Finishers","51-7021","Furniture Finishers"]
["(51-7031) Model Makers, Wood","51-7031","Model Makers, Wood"]
["(51-7032) Patternmakers, Wood","51-7032","Patternmakers, Wood"]
["(51-7041) Sawing Machine Setters, Operators, and Tenders, Wood","51-7041","Sawing Machine Setters, Operators, and Tenders, Wood"]
["(51-7042) Woodworking Machine Setters, Operators, and Tenders, Except Sawing","51-7042","Woodworking Machine Setters, Operators, and Tenders, Except Sawing"]
["(51-7099) Woodworkers, All Other","51-7099","Woodworkers, All Other"]
["(51-8011) Nuclear Power Reactor Operators","51-8011","Nuclear Power Reactor Operators"]
["(51-8012) Power Distributors and Dispatchers","51-8012","Power Distributors and Dispatchers"]
["(51-8013) Power Plant Operators","51-8013","Power Plant Operators"]
["(51-8021) Stationary Engineers and Boiler Operators","51-8021","Stationary Engineers and Boiler Operators"]
["(51-8031) Water and Wastewater Treatment Plant and System Operators","51-8031","Water and Wastewater Treatment Plant and System Operators"]
["(51-8091) Chemical Plant and System Operators","51-8091","Chemical Plant and System Operators"]
["(51-8092) Gas Plant Operators","51-8092","Gas Plant Operators"]
["(51-8093) Petroleum Pump System Operators, Refinery Operators, and Gaugers","51-8093","Petroleum Pump System Operators, Refinery Operators, and Gaugers"]
["(51-8099) Plant and System Operators, All Other","51-8099","Plant and System Operators, All Other"]
["(51-9011) Chemical Equipment Operators and Tenders","51-9011","Chemical Equipment Operators and Tenders"]
["(51-9012) Separating, Filtering, Clarifying, Precipitating, and Still Machine Setters, Operators, and Tenders","51-9012","Separating, Filtering, Clarifying, Precipitating, and Still Machine Setters, Operators, and Tenders"]
["(51-9021) Crushing, Grinding, and Polishing Machine Setters, Operators, and Tenders","51-9021","Crushing, Grinding, and Polishing Machine Setters, Operators, and Tenders"]
["(51-9022) Grinding and Polishing Workers, Hand","51-9022","Grinding and Polishing Workers, Hand"]
["(51-9023) Mixing and Blending Machine Setters, Operators, and Tenders","51-9023","Mixing and Blending Machine Setters, Operators, and Tenders"]
["(51-9031) Cutters and Trimmers, Hand","51-9031","Cutters and Trimmers, Hand"]
["(51-9032) Cutting and Slicing Machine Setters, Operators, and Tenders","51-9032","Cutting and Slicing Machine Setters, Operators, and Tenders"]
["(51-9041) Extruding, Forming, Pressing, and Compacting Machine Setters, Operators, and Tenders","51-9041","Extruding, Forming, Pressing, and Compacting Machine Setters, Operators, and Tenders"]
["(51-9051) Furnace, Kiln, Oven, Drier, and Kettle Operators and Tenders","51-9051","Furnace, Kiln, Oven, Drier, and Kettle Operators and Tenders"]
["(51-9061) Inspectors, Testers, Sorters, Samplers, and Weighers","51-9061","Inspectors, Testers, Sorters, Samplers, and Weighers"]
["(51-9071) Jewelers and Precious Stone and Metal Workers","51-9071","Jewelers and Precious Stone and Metal Workers"]
["(51-9081) Dental Laboratory Technicians","51-9081","Dental Laboratory Technicians"]
["(51-9082) Medical Appliance Technicians","51-9082","Medical Appliance Technicians"]
["(51-9083) Ophthalmic Laboratory Technicians","51-9083","Ophthalmic Laboratory Technicians"]
["(51-9111) Packaging and Filling Machine Operators and Tenders","51-9111","Packaging and Filling Machine Operators and Tenders"]
["(51-9121) Coating, Painting, and Spraying Machine Setters, Operators, and Tenders","51-9121","Coating, Painting, and Spraying Machine Setters, Operators, and Tenders"]
["(51-9122) Painters, Transportation Equipment","51-9122","Painters, Transportation Equipment"]
["(51-9123) Painting, Coating, and Decorating Workers","51-9123","Painting, Coating, and Decorating Workers"]
["(51-9141) Semiconductor Processors","51-9141","Semiconductor Processors"]
["(51-9151) Photographic Process Workers and Processing Machine Operators","51-9151","Photographic Process Workers and Processing Machine Operators"]
["(51-9191) Adhesive Bonding Machine Operators and Tenders","51-9191","Adhesive Bonding Machine Operators and Tenders"]
["(51-9192) Cleaning, Washing, and Metal Pickling Equipment Operators and Tenders","51-9192","Cleaning, Washing, and Metal Pickling Equipment Operators and Tenders"]
["(51-9193) Cooling and Freezing Equipment Operators and Tenders","51-9193","Cooling and Freezing Equipment Operators and Tenders"]
["(51-9194) Etchers and Engravers","51-9194","Etchers and Engravers"]
[{"$f":"CONCATENATE(\"(\",B772,\") \",C772)","v":"(51-9195) Molders, Shapers, and Casters, Except Metal and Plastic"},"51-9195","Molders, Shapers, and Casters, Except Metal and Plastic"]
["(51-9196) Paper Goods Machine Setters, Operators, and Tenders","51-9196","Paper Goods Machine Setters, Operators, and Tenders"]
["(51-9197) Tire Builders","51-9197","Tire Builders"]
["(51-9198) Helpers--Production Workers","51-9198","Helpers--Production Workers"]
["(53-1011) Aircraft Cargo Handling Supervisors","53-1011","Aircraft Cargo Handling Supervisors"]
["(53-1021) First-Line Supervisors of Helpers, Laborers, and Material Movers, Hand","53-1021","First-Line Supervisors of Helpers, Laborers, and Material Movers, Hand"]
["(53-1031) First-Line Supervisors of Transportation and Material-Moving Machine and Vehicle Operators","53-1031","First-Line Supervisors of Transportation and Material-Moving Machine and Vehicle Operators"]
["(53-2011) Airline Pilots, Copilots, and Flight Engineers","53-2011","Airline Pilots, Copilots, and Flight Engineers"]
["(53-2012) Commercial Pilots","53-2012","Commercial Pilots"]
["(53-2021) Air Traffic Controllers","53-2021","Air Traffic Controllers"]
["(53-2022) Airfield Operations Specialists","53-2022","Airfield Operations Specialists"]
["(53-2031) Flight Attendants","53-2031","Flight Attendants"]
["(53-3011) Ambulance Drivers and Attendants, Except Emergency Medical Technicians","53-3011","Ambulance Drivers and Attendants, Except Emergency Medical Technicians"]
["(53-3021) Bus Drivers, Transit and Intercity","53-3021","Bus Drivers, Transit and Intercity"]
["(53-3022) Bus Drivers, School or Special Client ","53-3022","Bus Drivers, School or Special Client "]
["(53-3022) Bus Drivers, School or Special Client","53-3022","Bus Drivers, School or Special Client"]
["(53-3031) Driver/Sales Workers","53-3031","Driver/Sales Workers"]
["(53-3032) Heavy and Tractor-Trailer Truck Drivers","53-3032","Heavy and Tractor-Trailer Truck Drivers"]
["(53-3033) Light Truck or Delivery Services Drivers","53-3033","Light Truck or Delivery Services Drivers"]
["(53-3041) Taxi Drivers and Chauffeurs","53-3041","Taxi Drivers and Chauffeurs"]
["(53-3099) Motor Vehicle Operators, All Other","53-3099","Motor Vehicle Operators, All Other"]
["(53-4011) Locomotive Engineers","53-4011","Locomotive Engineers"]
["(53-4012) Locomotive Firers","53-4012","Locomotive Firers"]
["(53-4013) Rail Yard Engineers, Dinkey Operators, and Hostlers","53-4013","Rail Yard Engineers, Dinkey Operators, and Hostlers"]
["(53-4021) Railroad Brake, Signal, and Switch Operators","53-4021","Railroad Brake, Signal, and Switch Operators"]
["(53-4031) Railroad Conductors and Yardmasters","53-4031","Railroad Conductors and Yardmasters"]
["(53-4041) Subway and Streetcar Operators","53-4041","Subway and Streetcar Operators"]
["(53-4099) Rail Transportation Workers, All Other","53-4099","Rail Transportation Workers, All Other"]
["(53-5011) Sailors and Marine Oilers","53-5011","Sailors and Marine Oilers"]
["(53-5021) Captains, Mates, and Pilots of Water Vessels","53-5021","Captains, Mates, and Pilots of Water Vessels"]
["(53-5022) Motorboat Operators","53-5022","Motorboat Operators"]
["(53-5031) Ship Engineers","53-5031","Ship Engineers"]
["(53-6011) Bridge and Lock Tenders","53-6011","Bridge and Lock Tenders"]
["(53-6021) Parking Lot Attendants","53-6021","Parking Lot Attendants"]
["(53-6031) Automotive and Watercraft Service Attendants","53-6031","Automotive and Watercraft Service Attendants"]
["(53-6041) Traffic Technicians","53-6041","Traffic Technicians"]
["(53-6051) Transportation Inspectors","53-6051","Transportation Inspectors"]
["(53-6061) Transportation Attendants, Except Flight Attendants and Baggage Porters","53-6061","Transportation Attendants, Except Flight Attendants and Baggage Porters"]
["(53-6099) Transportation Workers, All Other","53-6099","Transportation Workers, All Other"]
["(53-7011) Conveyor Operators and Tenders","53-7011","Conveyor Operators and Tenders"]
["(53-7021) Crane and Tower Operators","53-7021","Crane and Tower Operators"]
["(53-7031) Dredge Operators","53-7031","Dredge Operators"]
["(53-7032) Excavating and Loading Machine and Dragline Operators","53-7032","Excavating and Loading Machine and Dragline Operators"]
["(53-7033) Loading Machine Operators, Underground Mining","53-7033","Loading Machine Operators, Underground Mining"]
["(53-7041) Hoist and Winch Operators","53-7041","Hoist and Winch Operators"]
["(53-7051) Industrial Truck and Tractor Operators","53-7051","Industrial Truck and Tractor Operators"]
["(53-7061) Cleaners of Vehicles and Equipment","53-7061","Cleaners of Vehicles and Equipment"]
["(53-7062) Laborers and Freight, Stock, and Material Movers, Hand","53-7062","Laborers and Freight, Stock, and Material Movers, Hand"]
["(53-7063) Machine Feeders and Offbearers","53-7063","Machine Feeders and Offbearers"]
["(53-7064) Packers and Packagers, Hand","53-7064","Packers and Packagers, Hand"]
["(53-7071) Gas Compressor and Gas Pumping Station Operators","53-7071","Gas Compressor and Gas Pumping Station Operators"]
["(53-7072) Pump Operators, Except Wellhead Pumpers","53-7072","Pump Operators, Except Wellhead Pumpers"]
["(53-7073) Wellhead Pumpers","53-7073","Wellhead Pumpers"]
["(53-7081) Refuse and Recyclable Material Collectors","53-7081","Refuse and Recyclable Material Collectors"]
["(53-7111) Mine Shuttle Car Operators","53-7111","Mine Shuttle Car Operators"]
["(53-7121) Tank Car, Truck, and Ship Loaders","53-7121","Tank Car, Truck, and Ship Loaders"]
["(53-7199) Material Moving Workers, All Other","53-7199","Material Moving Workers, All Other"]
["(55-1011) Air Crew Officers","55-1011","Air Crew Officers"]
["(55-1012) Aircraft Launch and Recovery Officers","55-1012","Aircraft Launch and Recovery Officers"]
["(55-1013) Armored Assault Vehicle Officers","55-1013","Armored Assault Vehicle Officers"]
["(55-1014) Artillery and Missile Officers","55-1014","Artillery and Missile Officers"]
["(55-1015) Command and Control Center Officers","55-1015","Command and Control Center Officers"]
["(55-1016) Infantry Officers","55-1016","Infantry Officers"]
["(55-1017) Special Forces Officers","55-1017","Special Forces Officers"]
[{"$f":"CONCATENATE(\"(\",B836,\") \",C836)","v":"(55-1019) Military Officer Special and Tactical Operations Leaders, All Other"},"55-1019","Military Officer Special and Tactical Operations Leaders, All Other"]
["(55-2011) First-Line Supervisors of Air Crew Members","55-2011","First-Line Supervisors of Air Crew Members"]
["(55-2012) First-Line Supervisors of Weapons Specialists/Crew Members","55-2012","First-Line Supervisors of Weapons Specialists/Crew Members"]
["(55-2013) First-Line Supervisors of All Other Tactical Operations Specialists","55-2013","First-Line Supervisors of All Other Tactical Operations Specialists"]
["(55-3011) Air Crew Members","55-3011","Air Crew Members"]
["(55-3012) Aircraft Launch and Recovery Specialists","55-3012","Aircraft Launch and Recovery Specialists"]
["(55-3013) Armored Assault Vehicle Crew Members","55-3013","Armored Assault Vehicle Crew Members"]
["(55-3014) Artillery and Missile Crew Members","55-3014","Artillery and Missile Crew Members"]
["(55-3015) Command and Control Center Specialists","55-3015","Command and Control Center Specialists"]
["(55-3016) Infantry","55-3016","Infantry"]
["(55-3017) Radar and Sonar Technicians","55-3017","Radar and Sonar Technicians"]
["(55-3018) Special Forces","55-3018","Special Forces"]
["(55-3019) Military Enlisted Tactical Operations and Air/Weapons Specialists and Crew Members, All Other","55-3019","Military Enlisted Tactical Operations and Air/Weapons Specialists and Crew Members, All Other"]

{"sheet":"SOC Codes","index":8,"n_rows":861,"n_cols":2,"rows_kept":861,"cut":false,"hidden":false,"merged":[]}
["2010 SOC codes","Detailed Occupation Title"]
["11-1011","Chief Executives"]
["11-1021","General and Operations Managers"]
["11-1031","Legislators"]
["11-2011","Advertising and Promotions Managers"]
["11-2021","Marketing Managers"]
["11-2022","Sales Managers"]
["11-2031","Public Relations and Fundraising Managers"]
["11-3011","Administrative Services Managers"]
["11-3021","Computer and Information Systems Managers"]
["11-3031","Financial Managers"]
["11-3111","Compensation and Benefits Managers"]
["11-3131","Training and Development Managers"]
["11-3121","Human Resources Managers"]
["11-3051","Industrial Production Managers"]
["11-3061","Purchasing Managers"]
["11-3071","Transportation, Storage, and Distribution Managers"]
["11-9013","Farmers, Ranchers, and Other Agricultural Managers**"]
["11-9013","Farmers, Ranchers, and Other Agricultural Managers**"]
["11-9021","Construction Managers"]
["11-9031","Education Administrators, Preschool and Childcare Center/Program"]
["11-9032","Education Administrators, Elementary and Secondary School"]
["11-9033","Education Administrators, Postsecondary"]
["11-9039","Education Administrators, All Other"]
["11-9041","Architectural and Engineering Managers"]
["11-9051","Food Service Managers"]
["11-9061","Funeral Service Managers"]
["39-4031","Morticians, Undertakers, and Funeral Directors"]
["11-9071","Gaming Managers"]
["11-9081","Lodging Managers"]
["11-9111","Medical and Health Services Managers"]
["11-9121","Natural Sciences Managers"]
["11-9131","Postmasters and Mail Superintendents"]
["11-9141","Property, Real Estate, and Community Association Managers"]
["11-9151","Social and Community Service Managers"]
["11-9199","Managers, All Other"]
["13-1011","Agents and Business Managers of Artists, Performers, and Athletes"]
["13-1021","Buyers and Purchasing Agents, Farm Products"]
["13-1022","Wholesale and Retail Buyers, Except Farm Products"]
["13-1023","Purchasing Agents, Except Wholesale, Retail, and Farm Products"]
["13-1031","Claims Adjusters, Examiners, and Investigators"]
["13-1032","Insurance Appraisers, Auto Damage"]
["13-1041","Compliance Officers"]
["33-9093 ","Transportation Security Screeners** "]
["13-1051","Cost Estimators"]
["11-9161","Emergency Management Directors"]
["13-1071","Human Resources Specialists** "]
["13-1141","Compensation, Benefits, and Job Analysis Specialists"]
["13-1151","Training and Development Specialists"]
["13-1071","Human Resources Specialists** "]
["13-1075","Labor Relations Specialists"]
["13-1081","Logisticians"]
["13-1111","Management Analysts"]
["13-1121","Meeting, Convention, and Event Planners**"]
["13-1121","Meeting, Convention, and Event Planners**"]
["13-1161","Market Research Analysts and Marketing Specialists** "]
["13-1199 ","Business Operations Specialists, All Other"]
["13-2011","Accountants and Auditors"]
["13-2021","Appraisers and Assessors of Real Estate"]
["13-2031","Budget Analysts"]
["13-2041","Credit Analysts"]
["13-2051","Financial Analysts"]
["13-2052","Personal Financial Advisors"]
["13-2053","Insurance Underwriters"]
["13-2061","Financial Examiners"]
["13-2071","Credit Counselors"]
["13-2072","Loan Officers"]
["13-2081","Tax Examiners and Collectors, and Revenue Agents"]
["13-2082","Tax Preparers"]
["13-2099","Financial Specialists, All Other"]
["15-1111","Computer and Information Research Scientists"]
["15-1131","Computer Programmers"]
["15-1132","Software Developers, Applications"]
["15-1133","Software Developers, Systems Software"]
["15-1151","Computer User Support Specialists"]
["15-1143","Computer Network Architects** "]
["15-1121","Computer Systems Analysts"]
["15-1141","Database Administrators"]
["15-1142","Network and Computer Systems Administrators** "]
["15-1122","Information Security Analysts"]
["15-1134","Web Developers"]
["15-1142","Network and Computer Systems Administrators** "]
["15-1143","Computer Network Architects** "]
["15-1152","Computer Network Support Specialists"]
["15-1199","Computer Occupations, All Other"]
["15-2011","Actuaries"]
["15-2021","Mathematicians"]
["15-2031","Operations Research Analysts"]
["15-2041","Statisticians"]
["15-2091","Mathematical Technicians"]
["15-2099","Mathematical Science Occupations, All Other"]
["17-1011","Architects, Except Landscape and Naval"]
["17-1012","Landscape Architects"]
["17-1021","Cartographers and Photogrammetrists"]
["17-1022","Surveyors"]
["17-2011","Aerospace Engineers"]
["17-2021","Agricultural Engineers"]
["17-2031","Biomedical Engineers"]
["17-2041","Chemical Engineers"]
["17-2051","Civil Engineers"]
["17-2061","Computer Hardware Engineers"]
["17-2071","Electrical Engineers"]
["17-2072","Electronics Engineers, Except Computer"]
["17-2081","Environmental Engineers"]
["17-2111","Health and Safety Engineers, Except Mining Safety Engineers and Inspectors"]
["17-2112","Industrial Engineers"]
["17-2121","Marine Engineers and Naval Architects"]
["17-2131","Materials Engineers"]
["17-2141","Mechanical Engineers"]
["17-2151","Mining and Geological Engineers, Including Mining Safety Engineers"]
["17-2161","Nuclear Engineers"]
["17-2171","Petroleum Engineers"]
["17-2199","Engineers, All Other"]
["17-3011","Architectural and Civil Drafters"]
["17-3012","Electrical and Electronics Drafters"]
["17-3013","Mechanical Drafters"]
["17-3019","Drafters, All Other"]
["17-3021","Aerospace Engineering and Operations Technicians"]
["17-3022","Civil Engineering Technicians"]
["17-3023","Electrical and Electronics Engineering Technicians"]
["17-3024","Electro-Mechanical Technicians"]
["17-3025","Environmental Engineering Technicians"]
["17-3026","Industrial Engineering Technicians"]
["17-3027","Mechanical Engineering Technicians"]
["17-3029","Engineering Technicians, Except Drafters, All Other"]
["17-3031","Surveying and Mapping Technicians"]
["19-1011","Animal Scientists"]
["19-1012","Food Scientists and Technologists"]
["19-1013","Soil and Plant Scientists"]
["19-1021","Biochemists and Biophysicists"]
["19-1022","Microbiologists"]
["19-1023","Zoologists and Wildlife Biologists"]
["19-1029","Biological Scientists, All Other"]
["19-1031","Conservation Scientists"]
["19-1032","Foresters"]
["19-1041","Epidemiologists"]
["19-1042","Medical Scientists, Except Epidemiologists"]
["19-1099","Life Scientists, All Other"]
["19-2011","Astronomers"]
["19-2012","Physicists"]
["19-2021","Atmospheric and Space Scientists"]
["19-2031","Chemists"]
["19-2032","Materials Scientists"]
["19-2041","Environmental Scientists and Specialists, Including Health"]
["19-2042","Geoscientists, Except Hydrologists and Geographers"]
["19-2043","Hydrologists"]
["19-2099","Physical Scientists, All Other"]
["19-3011","Economists"]
["13-1161  ","Market Research Analysts and Marketing Specialists**"]
["19-3022","Survey Researchers"]
["19-3031","Clinical, Counseling, and School Psychologists"]
["19-3032","Industrial-Organizational Psychologists"]
["19-3039","Psychologists, All Other"]
["19-3041","Sociologists"]
["19-3051","Urban and Regional Planners"]
["19-3091","Anthropologists and Archeologists"]
["19-3092","Geographers"]
["19-3093","Historians"]
["19-3094","Political Scientists"]
["19-3099","Social Scientists and Related Workers, All Other"]
["19-4011","Agricultural and Food Science Technicians"]
["19-4021","Biological Technicians"]
["19-4031","Chemical Technicians"]
["19-4041","Geological and Petroleum Technicians"]
["19-4051","Nuclear Technicians"]
["19-4061","Social Science Research Assistants"]
["19-4091","Environmental Science and Protection Technicians, Including Health"]
["19-4092","Forensic Science Technicians"]
["19-4093","Forest and Conservation Technicians"]
["19-4099","Life, Physical, and Social Science Technicians, All Other"]
["21-1011","Substance Abuse and Behavioral Disorder Counselors"]
["21-1012","Educational, Guidance, School, and Vocational Counselors"]
["21-1013","Marriage and Family Therapists"]
["21-1014","Mental Health Counselors"]
["21-1015","Rehabilitation Counselors"]
["21-1019","Counselors, All Other"]
["21-1021","Child, Family, and School Social Workers"]
["21-1022","Healthcare Social Workers"]
["21-1023","Mental Health and Substance Abuse Social Workers"]
["21-1029","Social Workers, All Other"]
["21-1091","Health Educators "]
["21-1094","Community Health Workers**"]
["21-1092","Probation Officers and Correctional Treatment Specialists"]
["21-1093","Social and Human Service Assistants"]
["21-1094","Community Health Workers**"]
["21-1099","Community and Social Service Specialists, All Other"]
["21-2011","Clergy"]
["21-2021","Directors, Religious Activities and Education"]
["21-2099","Religious Workers, All Other"]
["23-1011","Lawyers"]
["23-1021","Administrative Law Judges, Adjudicators, and Hearing Officers"]
["23-1022","Arbitrators, Mediators, and Conciliators"]
["23-1023","Judges, Magistrate Judges, and Magistrates"]
["23-2011","Paralegals and Legal Assistants** "]
["23-2091","Court Reporters"]
["23-1012","Judicial Law Clerks"]
["23-2011","Paralegals and Legal Assistants** "]
["23-2093","Title Examiners, Abstractors, and Searchers"]
["23-2099","Legal Support Workers, All Other"]
["25-1011","Business Teachers, Postsecondary"]
["25-1021","Computer Science Teachers, Postsecondary"]
["25-1022","Mathematical Science Teachers, Postsecondary"]
["25-1031","Architecture Teachers, Postsecondary"]
["25-1032","Engineering Teachers, Postsecondary"]
["25-1041","Agricultural Sciences Teachers, Postsecondary"]
["25-1042","Biological Science Teachers, Postsecondary"]
["25-1043","Forestry and Conservation Science Teachers, Postsecondary"]
["25-1051","Atmospheric, Earth, Marine, and Space Sciences Teachers, Postsecondary"]
["25-1052","Chemistry Teachers, Postsecondary"]
["25-1053","Environmental Science Teachers, Postsecondary"]
["25-1054","Physics Teachers, Postsecondary"]
["25-1061","Anthropology and Archeology Teachers, Postsecondary"]
["25-1062","Area, Ethnic, and Cultural Studies Teachers, Postsecondary"]
["25-1063","Economics Teachers, Postsecondary"]
["25-1064","Geography Teachers, Postsecondary"]
["25-1065","Political Science Teachers, Postsecondary"]
["25-1066","Psychology Teachers, Postsecondary"]
["25-1067","Sociology Teachers, Postsecondary"]
["25-1069","Social Sciences Teachers, Postsecondary, All Other"]
["25-1071","Health Specialties Teachers, Postsecondary"]
["25-1072","Nursing Instructors and Teachers, Postsecondary"]
["25-1081","Education Teachers, Postsecondary"]
["25-1082","Library Science Teachers, Postsecondary"]
["25-1111","Criminal Justice and Law Enforcement Teachers, Postsecondary"]
["25-1112","Law Teachers, Postsecondary"]
["25-1113","Social Work Teachers, Postsecondary"]
["25-1121","Art, Drama, and Music Teachers, Postsecondary"]
["25-1122","Communications Teachers, Postsecondary"]
["25-1123","English Language and Literature Teachers, Postsecondary"]
["25-1124","Foreign Language and Literature Teachers, Postsecondary"]
["25-1125","History Teachers, Postsecondary"]
["25-1126","Philosophy and Religion Teachers, Postsecondary"]
["25-1191","Graduate Teaching Assistants"]
["25-1192","Home Economics Teachers, Postsecondary"]
["25-1193","Recreation and Fitness Studies Teachers, Postsecondary"]
["25-1194","Vocational Education Teachers, Postsecondary"]
["25-1199","Postsecondary Teachers, All Other"]
["25-2011","Preschool Teachers, Except Special Education"]
["25-2012","Kindergarten Teachers, Except Special Education"]
["25-2021","Elementary School Teachers, Except Special Education"]
["25-2022","Middle School Teachers, Except Special and Career/Technical Education"]
["25-2023","Career/Technical Education Teachers, Middle School"]
["25-2031","Secondary School Teachers, Except Special and Career/Technical Education"]
["25-2032","Career/Technical Education Teachers, Secondary School"]
["25-2051","Special Education Teachers, Preschool"]
["25-2052","Special Education Teachers, Kindergarten and Elementary School"]
["25-2053","Special Education Teachers, Middle School"]
["25-2054","Special Education Teachers, Secondary School"]
["25-3011","Adult Basic and Secondary Education and Literacy Teachers and Instructors "]
["25-3021","Self-Enrichment Education Teachers"]
["25-2059","Special Education Teachers, All Other"]
["25-3099","Teachers and Instructors, All Other"]
["25-4011","Archivists"]
["25-4012","Curators"]
["25-4013","Museum Technicians and Conservators"]
["25-4021","Librarians"]
["25-4031","Library Technicians"]
["25-9011","Audio-Visual and Multimedia Collections Specialists"]
["25-9021","Farm and Home Management Advisors"]
["25-9031","Instructional Coordinators"]
["25-9041","Teacher Assistants"]
["25-9099","Education, Training, and Library Workers, All Other"]
["27-1011","Art Directors"]
["27-1012","Craft Artists"]
["27-1013","Fine Artists, Including Painters, Sculptors, and Illustrators"]
["27-1014","Multimedia Artists and Animators"]
["27-1019","Artists and Related Workers, All Other"]
["27-1021","Commercial and Industrial Designers"]
["27-1022","Fashion Designers"]
["27-1023","Floral Designers"]
["27-1024","Graphic Designers"]
["27-1025","Interior Designers"]
["27-1026","Merchandise Displayers and Window Trimmers"]
["27-1027","Set and Exhibit Designers"]
["27-1029","Designers, All Other"]
["27-2011","Actors"]
["27-2012","Producers and Directors"]
["27-2021","Athletes and Sports Competitors"]
["27-2022","Coaches and Scouts"]
["27-2023","Umpires, Referees, and Other Sports Officials"]
["27-2031","Dancers"]
["27-2032","Choreographers"]
["27-2041","Music Directors and Composers"]
["27-2042","Musicians and Singers"]
["27-2099","Entertainers and Performers, Sports and Related Workers, All Other"]
["27-3011","Radio and Television Announcers"]
["27-3012","Public Address System and Other Announcers"]
["27-3021","Broadcast News Analysts"]
["27-3022","Reporters and Correspondents"]
["27-3031","Public Relations Specialists"]
["13-1121","Meeting, Convention, and Event Planners** "]
["13-1161  ","Market Research Analysts and Marketing Specialists**"]
["27-3041","Editors"]
["27-3042","Technical Writers"]
["27-3043","Writers and Authors"]
["27-3091","Interpreters and Translators"]
["27-3099","Media and Communication Workers, All Other"]
["27-4011","Audio and Video Equipment Technicians"]
["27-4012","Broadcast Technicians"]
["27-4013","Radio Operators"]
["27-4014","Sound Engineering Technicians"]
["27-4021","Photographers"]
["27-4031","Camera Operators, Television, Video, and Motion Picture"]
["27-4032","Film and Video Editors"]
["27-4099","Media and Communication Equipment Workers, All Other"]
["29-1011","Chiropractors"]
["29-1021","Dentists, General"]
["29-1022","Oral and Maxillofacial Surgeons"]
["29-1023","Orthodontists"]
["29-1024","Prosthodontists"]
["29-1029","Dentists, All Other Specialists"]
["29-1031","Dietitians and Nutritionists"]
["29-1041","Optometrists"]
["29-1051","Pharmacists"]
["29-1061","Anesthesiologists"]
["29-1062","Family and General Practitioners"]
["29-1063","Internists, General"]
["29-1064","Obstetricians and Gynecologists"]
["29-1065","Pediatricians, General"]
["29-1066","Psychiatrists"]
["29-1067","Surgeons"]
["29-1069","Physicians and Surgeons, All Other"]
["29-1071","Physician Assistants"]
["29-1081","Podiatrists"]
["29-1141","Registered Nurses"]
["29-1151","Nurse Anesthetists"]
["29-1161","Nurse Midwives"]
["29-1171","Nurse Practitioners"]
["29-1181","Audiologists"]
["29-1122","Occupational Therapists"]
["29-1123","Physical Therapists"]
["29-1124","Radiation Therapists"]
["29-1125","Recreational Therapists"]
["29-1126","Respiratory Therapists"]
["29-1127","Speech-Language Pathologists"]
["29-1128","Exercise Physiologists"]
["29-1129","Therapists, All Other"]
["29-1131","Veterinarians"]
["29-1199","Health Diagnosing and Treating Practitioners, All Other"]
["29-2011","Medical and Clinical Laboratory Technologists"]
["29-2012","Medical and Clinical Laboratory Technicians"]
["29-2021","Dental Hygienists"]
["29-2031","Cardiovascular Technologists and Technicians"]
["29-2032","Diagnostic Medical Sonographers"]
["29-2033","Nuclear Medicine Technologists"]
["29-2034","Radiologic Technologists "]
["29-2035 ","Magnetic Resonance Imaging Technologists"]
["29-2041","Emergency Medical Technicians and Paramedics"]
["29-2051","Dietetic Technicians"]
["29-2052","Pharmacy Technicians"]
["29-2053","Psychiatric Technicians"]
["29-2054","Respiratory Therapy Technicians"]
["29-2055","Surgical Technologists"]
["29-2056","Veterinary Technologists and Technicians"]
["29-2061","Licensed Practical and Licensed Vocational Nurses"]
["29-2071","Medical Records and Health Information Technicians"]
["29-2081","Opticians, Dispensing"]
["29-2091","Orthotists and Prosthetists"]
["29-2092","Hearing Aid Specialists"]
["29-2057","Ophthalmic Medical Technicians"]
["29-2099","Health Technologists and Technicians, All Other"]
["29-9011","Occupational Health and Safety Specialists"]
["29-9012","Occupational Health and Safety Technicians"]
["29-9091","Athletic Trainers"]
["29-9092","Genetic Counselors"]
["29-9099","Healthcare Practitioners and Technical Workers, All Other"]
["31-1011","Home Health Aides"]
["31-1015","Orderlies"]
["31-1014","Nursing Assistants"]
["31-1013","Psychiatric Aides"]
["31-2011","Occupational Therapy Assistants"]
["31-2012","Occupational Therapy Aides"]
["31-2021","Physical Therapist Assistants"]
["31-2022","Physical Therapist Aides"]
["31-9011","Massage Therapists"]
["31-9091","Dental Assistants"]
["31-9092","Medical Assistants"]
["31-9093","Medical Equipment Preparers"]
["31-9094","Medical Transcriptionists"]
["31-9095","Pharmacy Aides"]
["31-9096","Veterinary Assistants and Laboratory Animal Caretakers"]
["31-9097","Phlebotomists"]
["31-9099","Healthcare Support Workers, All Other"]
["33-1011","First-Line Supervisors of Correctional Officers"]
["33-1012","First-Line Supervisors of Police and Detectives"]
["33-1021","First-Line Supervisors of Fire Fighting and Prevention Workers"]
["33-1099","First-Line Supervisors of Protective Service Workers, All Other"]
["33-2011","Firefighters"]
["33-2021","Fire Inspectors and Investigators"]
["33-2022","Forest Fire Inspectors and Prevention Specialists"]
["33-3011","Bailiffs"]
["33-3012","Correctional Officers and Jailers"]
["33-3021","Detectives and Criminal Investigators"]
["33-3031","Fish and Game Wardens"]
["33-3041","Parking Enforcement Workers"]
["33-3051","Police and Sheriff's Patrol Officers"]
["33-3052","Transit and Railroad Police"]
["33-9011","Animal Control Workers"]
["33-9021","Private Detectives and Investigators"]
["33-9031","Gaming Surveillance Officers and Gaming Investigators"]
["33-9032","Security Guards"]
["33-9093 ","Transportation Security Screeners** "]
["33-9091","Crossing Guards"]
["33-9092","Lifeguards, Ski Patrol, and Other Recreational Protective Service Workers"]
["33-9093 ","Transportation Security Screeners** "]
["33-9099","Protective Service Workers, All Other"]
["35-1011","Chefs and Head Cooks"]
["35-1012","First-Line Supervisors of Food Preparation and Serving Workers"]
["35-2011","Cooks, Fast Food"]
["35-2012","Cooks, Institution and Cafeteria"]
["35-2013","Cooks, Private Household"]
["35-2014","Cooks, Restaurant"]
["35-2015","Cooks, Short Order"]
["35-2019","Cooks, All Other"]
["35-2021","Food Preparation Workers"]
["35-3011","Bartenders"]
["35-3021","Combined Food Preparation and Serving Workers, Including Fast Food"]
["35-3022","Counter Attendants, Cafeteria, Food Concession, and Coffee Shop"]
["35-3031","Waiters and Waitresses"]
["35-3041","Food Servers, Nonrestaurant"]
["35-9011","Dining Room and Cafeteria Attendants and Bartender Helpers"]
["35-9021","Dishwashers"]
["35-9031","Hosts and Hostesses, Restaurant, Lounge, and Coffee Shop"]
["35-9099","Food Preparation and Serving Related Workers, All Other"]
["37-1011","First-Line Supervisors of Housekeeping and Janitorial Workers"]
["37-1012","First-Line Supervisors of Landscaping, Lawn Service, and Groundskeeping Workers"]
["37-2011","Janitors and Cleaners, Except Maids and Housekeeping Cleaners"]
["37-2012","Maids and Housekeeping Cleaners"]
["37-2019","Building Cleaning Workers, All Other"]
["37-2021","Pest Control Workers"]
["37-3011","Landscaping and Groundskeeping Workers"]
["37-3012","Pesticide Handlers, Sprayers, and Applicators, Vegetation"]
["37-3013","Tree Trimmers and Pruners"]
["37-3019","Grounds Maintenance Workers, All Other"]
["39-1011","Gaming Supervisors"]
["39-1012","Slot Supervisors"]
["39-1021","First-Line Supervisors of Personal Service Workers"]
["39-2011","Animal Trainers"]
["39-2021","Nonfarm Animal Caretakers"]
["39-3011","Gaming Dealers"]
["39-3012","Gaming and Sports Book Writers and Runners"]
["39-3019","Gaming Service Workers, All Other"]
["39-3021","Motion Picture Projectionists"]
["39-3031","Ushers, Lobby Attendants, and Ticket Takers"]
["39-3091","Amusement and Recreation Attendants"]
["39-3092","Costume Attendants"]
["39-3093","Locker Room, Coatroom, and Dressing Room Attendants"]
["39-3099","Entertainment Attendants and Related Workers, All Other"]
["39-4011","Embalmers"]
["39-4021","Funeral Attendants"]
["39-5011","Barbers"]
["39-5012","Hairdressers, Hairstylists, and Cosmetologists"]
["39-5091","Makeup Artists, Theatrical and Performance"]
["39-5092","Manicurists and Pedicurists"]
["39-5093","Shampooers"]
["39-5094","Skincare Specialists"]
["39-6011","Baggage Porters and Bellhops"]
["39-6012","Concierges"]
["39-7011","Tour Guides and Escorts"]
["39-7012","Travel Guides"]
["53-2031","Flight Attendants"]
["53-6061","Transportation Attendants, Except Flight Attendants "]
["39-9011","Childcare Workers"]
["39-9021","Personal Care Aides"]
["39-9031","Fitness Trainers and Aerobics Instructors"]
["39-9032","Recreation Workers"]
["39-9041","Residential Advisors"]
["39-9099","Personal Care and Service Workers, All Other"]
["41-1011","First-Line Supervisors of Retail Sales Workers"]
["41-1012","First-Line Supervisors of Non-Retail Sales Workers"]
["41-2011","Cashiers"]
["41-2012","Gaming Change Persons and Booth Cashiers"]
["41-2021","Counter and Rental Clerks"]
["41-2022","Parts Salespersons"]
["41-2031","Retail Salespersons"]
["41-3011","Advertising Sales Agents"]
["41-3021","Insurance Sales Agents"]
["41-3031","Securities, Commodities, and Financial Services Sales Agents"]
["41-3041","Travel Agents"]
["41-3099","Sales Representatives, Services, All Other"]
["41-4011","Sales Representatives, Wholesale and Manufacturing, Technical and Scientific Products"]
["41-4012","Sales Representatives, Wholesale and Manufacturing, Except Technical and Scientific Products"]
["41-9011","Demonstrators and Product Promoters"]
["41-9012","Models"]
["41-9021","Real Estate Brokers"]
["41-9022","Real Estate Sales Agents"]
["41-9031","Sales Engineers"]
["41-9041","Telemarketers"]
["41-9091","Door-to-Door Sales Workers, News and Street Vendors, and Related Workers"]
["41-9099","Sales and Related Workers, All Other"]
["13-1131","Fundraisers"]
["43-1011","First-Line Supervisors of Office and Administrative Support Workers"]
["43-2011","Switchboard Operators, Including Answering Service"]
["43-2021","Telephone Operators"]
["43-2099","Communications Equipment Operators, All Other"]
["43-3011","Bill and Account Collectors"]
["43-3021","Billing and Posting Clerks"]
["43-3031","Bookkeeping, Accounting, and Auditing Clerks"]
["43-3041","Gaming Cage Workers"]
["43-3051","Payroll and Timekeeping Clerks"]
["43-3061","Procurement Clerks"]
["43-3071","Tellers"]
["43-4011","Brokerage Clerks"]
["43-4021","Correspondence Clerks"]
["43-4031","Court, Municipal, and License Clerks"]
["43-4041","Credit Authorizers, Checkers, and Clerks"]
["43-4051","Customer Service Representatives"]
["43-4061","Eligibility Interviewers, Government Programs"]
["43-4071","File Clerks"]
["43-4081","Hotel, Motel, and Resort Desk Clerks"]
["43-4111","Interviewers, Except Eligibility and Loan"]
["43-4121","Library Assistants, Clerical"]
["43-4131","Loan Interviewers and Clerks"]
["43-4141","New Accounts Clerks"]
["43-4151","Order Clerks"]
["43-4161","Human Resources Assistants, Except Payroll and Timekeeping"]
["43-4171","Receptionists and Information Clerks"]
["43-4181","Reservation and Transportation Ticket Agents and Travel Clerks"]
["43-4199","Information and Record Clerks, All Other"]
["43-5011","Cargo and Freight Agents"]
["43-5021","Couriers and Messengers"]
["43-5031","Police, Fire, and Ambulance Dispatchers"]
["43-5032","Dispatchers, Except Police, Fire, and Ambulance"]
["43-5041","Meter Readers, Utilities"]
["43-5051","Postal Service Clerks"]
["43-5052","Postal Service Mail Carriers"]
["43-5053","Postal Service Mail Sorters, Processors, and Processing Machine Operators"]
["43-5061","Production, Planning, and Expediting Clerks"]
["43-5071","Shipping, Receiving, and Traffic Clerks"]
["43-5081","Stock Clerks and Order Fillers"]
["43-5111","Weighers, Measurers, Checkers, and Samplers, Recordkeeping"]
["43-6011","Executive Secretaries and Executive Administrative Assistants"]
["43-6012","Legal Secretaries"]
["43-6013","Medical Secretaries"]
["43-6014","Secretaries and Administrative Assistants, Except Legal, Medical, and Executive"]
["43-9011","Computer Operators"]
["43-9021","Data Entry Keyers"]
["43-9022","Word Processors and Typists"]
["43-9031","Desktop Publishers"]
["43-9041","Insurance Claims and Policy Processing Clerks"]
["43-9051","Mail Clerks and Mail Machine Operators, Except Postal Service"]
["43-9061","Office Clerks, General"]
["43-9071","Office Machine Operators, Except Computer"]
["43-9081","Proofreaders and Copy Markers"]
["43-9111","Statistical Assistants"]
["43-3099 ","Financial Clerks, All Other"]
["43-9199","Office and Administrative Support Workers, All Other"]
["45-1011","First-Line Supervisors of Farming, Fishing, and Forestry Workers"]
["13-1074","Farm Labor Contractors"]
["45-2011","Agricultural Inspectors"]
["45-2021","Animal Breeders"]
["45-2041","Graders and Sorters, Agricultural Products"]
["45-2091","Agricultural Equipment Operators"]
["45-2092","Farmworkers and Laborers, Crop, Nursery, and Greenhouse"]
["45-2093","Farmworkers, Farm, Ranch, and Aquacultural Animals"]
["45-2099","Agricultural Workers, All Other"]
["45-3011","Fishers and Related Fishing Workers"]
["45-3021","Hunters and Trappers"]
["45-4011","Forest and Conservation Workers"]
["45-4021","Fallers"]
["45-4022","Logging Equipment Operators"]
["45-4023","Log Graders and Scalers"]
["45-4029","Logging Workers, All Other"]
["47-1011","First-Line Supervisors of Construction Trades and Extraction Workers"]
["47-2011","Boilermakers"]
["47-2021","Brickmasons and Blockmasons"]
["47-2022","Stonemasons"]
["47-2031","Carpenters"]
["47-2041","Carpet Installers"]
["47-2042","Floor Layers, Except Carpet, Wood, and Hard Tiles"]
["47-2043","Floor Sanders and Finishers"]
["47-2044","Tile and Marble Setters"]
["47-2051","Cement Masons and Concrete Finishers"]
["47-2053","Terrazzo Workers and Finishers"]
["47-2061","Construction Laborers"]
["47-2071","Paving, Surfacing, and Tamping Equipment Operators"]
["47-2072","Pile-Driver Operators"]
["47-2073","Operating Engineers and Other Construction Equipment Operators"]
["47-2081","Drywall and Ceiling Tile Installers"]
["47-2082","Tapers"]
["47-2111","Electricians"]
["47-2231","Solar Photovoltaic Installers** "]
["47-2121","Glaziers"]
["47-2131","Insulation Workers, Floor, Ceiling, and Wall"]
["47-2132","Insulation Workers, Mechanical"]
["47-2141","Painters, Construction and Maintenance"]
["47-2142","Paperhangers"]
["47-2151","Pipelayers"]
["47-2152","Plumbers, Pipefitters, and Steamfitters"]
["47-2161","Plasterers and Stucco Masons"]
["47-2171","Reinforcing Iron and Rebar Workers"]
["47-2181","Roofers"]
["47-2231","Solar Photovoltaic Installers** "]
["47-2211","Sheet Metal Workers"]
["47-2221","Structural Iron and Steel Workers"]
["47-3011","Helpers--Brickmasons, Blockmasons, Stonemasons, and Tile and Marble Setters"]
["47-3012","Helpers--Carpenters"]
["47-3013","Helpers--Electricians"]
["47-3014","Helpers--Painters, Paperhangers, Plasterers, and Stucco Masons"]
["47-3015","Helpers--Pipelayers, Plumbers, Pipefitters, and Steamfitters"]
["47-3016","Helpers--Roofers"]
["47-3019","Helpers, Construction Trades, All Other"]
["47-4011","Construction and Building Inspectors"]
["47-4021","Elevator Installers and Repairers"]
["47-4031","Fence Erectors"]
["47-4041","Hazardous Materials Removal Workers"]
["47-4051","Highway Maintenance Workers"]
["47-4061","Rail-Track Laying and Maintenance Equipment Operators"]
["47-4071","Septic Tank Servicers and Sewer Pipe Cleaners"]
["47-4091","Segmental Pavers"]
["47-2231","Solar Photovoltaic Installers** "]
["47-4099","Construction and Related Workers, All Other"]
["47-5011","Derrick Operators, Oil and Gas"]
["47-5012","Rotary Drill Operators, Oil and Gas"]
["47-5013","Service Unit Operators, Oil, Gas, and Mining"]
["47-5021","Earth Drillers, Except Oil and Gas"]
["47-5031","Explosives Workers, Ordnance Handling Experts, and Blasters"]
["47-5041","Continuous Mining Machine Operators"]
["47-5042","Mine Cutting and Channeling Machine Operators"]
["47-5049","Mining Machine Operators, All Other"]
["47-5051","Rock Splitters, Quarry"]
["47-5061","Roof Bolters, Mining"]
["47-5071","Roustabouts, Oil and Gas"]
["47-5081","Helpers--Extraction Workers"]
["47-5099","Extraction Workers, All Other"]
["49-1011","First-Line Supervisors of Mechanics, Installers, and Repairers"]
["49-2011","Computer, Automated Teller, and Office Machine Repairers"]
["49-2021","Radio, Cellular, and Tower Equipment Installers and Repairers"]
["49-2022","Telecommunications Equipment Installers and Repairers, Except Line Installers"]
["49-2091","Avionics Technicians"]
["49-2092","Electric Motor, Power Tool, and Related Repairers"]
["49-2093","Electrical and Electronics Installers and Repairers, Transportation Equipment"]
["49-2094","Electrical and Electronics Repairers, Commercial and Industrial Equipment"]
["49-2095","Electrical and Electronics Repairers, Powerhouse, Substation, and Relay"]
["49-2096","Electronic Equipment Installers and Repairers, Motor Vehicles"]
["49-2097","Electronic Home Entertainment Equipment Installers and Repairers"]
["49-2098","Security and Fire Alarm Systems Installers"]
["49-3011","Aircraft Mechanics and Service Technicians"]
["49-3021","Automotive Body and Related Repairers"]
["49-3022","Automotive Glass Installers and Repairers"]
["49-3023","Automotive Service Technicians and Mechanics"]
["49-3031","Bus and Truck Mechanics and Diesel Engine Specialists"]
["49-3041","Farm Equipment Mechanics and Service Technicians"]
["49-3042","Mobile Heavy Equipment Mechanics, Except Engines"]
["49-3043","Rail Car Repairers"]
["49-3051","Motorboat Mechanics and Service Technicians"]
["49-3052","Motorcycle Mechanics"]
["49-3053","Outdoor Power Equipment and Other Small Engine Mechanics"]
["49-3091","Bicycle Repairers"]
["49-3092","Recreational Vehicle Service Technicians"]
["49-3093","Tire Repairers and Changers"]
["49-9011","Mechanical Door Repairers"]
["49-9012","Control and Valve Installers and Repairers, Except Mechanical Door"]
["49-9021","Heating, Air Conditioning, and Refrigeration Mechanics and Installers"]
["47-2231","Solar Photovoltaic Installers** "]
["49-9031","Home Appliance Repairers"]
["49-9041","Industrial Machinery Mechanics"]
["49-9071","Maintenance and Repair Workers, General"]
["49-9043","Maintenance Workers, Machinery"]
["49-9044","Millwrights"]
["49-9045","Refractory Materials Repairers, Except Brickmasons"]
["49-9051","Electrical Power-Line Installers and Repairers"]
["49-9052","Telecommunications Line Installers and Repairers"]
["49-9061","Camera and Photographic Equipment Repairers"]
["49-9062","Medical Equipment Repairers"]
["49-9063","Musical Instrument Repairers and Tuners"]
["49-9064","Watch Repairers"]
["49-9069","Precision Instrument and Equipment Repairers, All Other"]
["49-9091","Coin, Vending, and Amusement Machine Servicers and Repairers"]
["49-9092","Commercial Divers"]
["49-9093","Fabric Menders, Except Garment"]
["49-9094","Locksmiths and Safe Repairers"]
["49-9095","Manufactured Building and Mobile Home Installers"]
["49-9096","Riggers"]
["49-9097","Signal and Track Switch Repairers"]
["49-9098","Helpers--Installation, Maintenance, and Repair Workers"]
["47-2231","Solar Photovoltaic Installers** "]
["49-9081","Wind Turbine Service Technicians"]
["49-9099","Installation, Maintenance, and Repair Workers, All Other"]
["51-1011","First-Line Supervisors of Production and Operating Workers"]
["51-2011","Aircraft Structure, Surfaces, Rigging, and Systems Assemblers"]
["51-2021","Coil Winders, Tapers, and Finishers"]
["51-2022","Electrical and Electronic Equipment Assemblers"]
["51-2023","Electromechanical Equipment Assemblers"]
["51-2031","Engine and Other Machine Assemblers"]
["51-2041","Structural Metal Fabricators and Fitters"]
["51-2091","Fiberglass Laminators and Fabricators"]
["51-2092","Team Assemblers"]
["51-2093","Timing Device Assemblers and Adjusters"]
["51-2099","Assemblers and Fabricators, All Other"]
["51-3011","Bakers"]
["51-3021","Butchers and Meat Cutters"]
["51-3022","Meat, Poultry, and Fish Cutters and Trimmers"]
["51-3023","Slaughterers and Meat Packers"]
["51-3091","Food and Tobacco Roasting, Baking, and Drying Machine Operators and Tenders"]
["51-3092","Food Batchmakers"]
["51-3093","Food Cooking Machine Operators and Tenders"]
["51-4011","Computer-Controlled Machine Tool Operators, Metal and Plastic"]
["51-4012","Computer Numerically Controlled Machine Tool Programmers, Metal and Plastic"]
["51-4021","Extruding and Drawing Machine Setters, Operators, and Tenders, Metal and Plastic"]
["51-4022","Forging Machine Setters, Operators, and Tenders, Metal and Plastic"]
["51-4023","Rolling Machine Setters, Operators, and Tenders, Metal and Plastic"]
["51-4031","Cutting, Punching, and Press Machine Setters, Operators, and Tenders, Metal and Plastic"]
["51-4032","Drilling and Boring Machine Tool Setters, Operators, and Tenders, Metal and Plastic"]
["51-4033","Grinding, Lapping, Polishing, and Buffing Machine Tool Setters, Operators, and Tenders, Metal and Plastic"]
["51-4034","Lathe and Turning Machine Tool Setters, Operators, and Tenders, Metal and Plastic"]
["51-4035","Milling and Planing Machine Setters, Operators, and Tenders, Metal and Plastic"]
["51-4041","Machinists"]
["51-4051","Metal-Refining Furnace Operators and Tenders"]
["51-4052","Pourers and Casters, Metal"]
["51-4061","Model Makers, Metal and Plastic"]
["51-4062","Patternmakers, Metal and Plastic"]
["51-4071","Foundry Mold and Coremakers"]
["51-4072","Molding, Coremaking, and Casting Machine Setters, Operators, and Tenders, Metal and Plastic"]
["51-4081","Multiple Machine Tool Setters, Operators, and Tenders, Metal and Plastic"]
["51-4111","Tool and Die Makers"]
["51-4121","Welders, Cutters, Solderers, and Brazers"]
["51-4122","Welding, Soldering, and Brazing Machine Setters, Operators, and Tenders"]
["51-4191","Heat Treating Equipment Setters, Operators, and Tenders, Metal and Plastic"]
["51-4192","Layout Workers, Metal and Plastic"]
["51-4193","Plating and Coating Machine Setters, Operators, and Tenders, Metal and Plastic"]
["51-4194","Tool Grinders, Filers, and Sharpeners"]
["51-4199","Metal Workers and Plastic Workers, All Other"]
["51-5113","Print Binding and Finishing Workers**"]
["51-5113","Print Binding and Finishing Workers**"]
["51-5112","Printing Press Operators**"]
["51-5113","Print Binding and Finishing Workers**"]
["51-5111","Prepress Technicians and Workers"]
["51-5112","Printing Press Operators**"]
["51-6011","Laundry and Dry-Cleaning Workers"]
["51-6021","Pressers, Textile, Garment, and Related Materials"]
["51-6031","Sewing Machine Operators"]
["51-6041","Shoe and Leather Workers and Repairers"]
["51-6042","Shoe Machine Operators and Tenders"]
["51-6051","Sewers, Hand"]
["51-6052","Tailors, Dressmakers, and Custom Sewers"]
["51-6061","Textile Bleaching and Dyeing Machine Operators and Tenders"]
["51-6062","Textile Cutting Machine Setters, Operators, and Tenders"]
["51-6063","Textile Knitting and Weaving Machine Setters, Operators, and Tenders"]
["51-6064","Textile Winding, Twisting, and Drawing Out Machine Setters, Operators, and Tenders"]
["51-6091","Extruding and Forming Machine Setters, Operators, and Tenders, Synthetic and Glass Fibers"]
["51-6092","Fabric and Apparel Patternmakers"]
["51-6093","Upholsterers"]
["51-6099","Textile, Apparel, and Furnishings Workers, All Other"]
["51-7011","Cabinetmakers and Bench Carpenters"]
["51-7021","Furniture Finishers"]
["51-7031","Model Makers, Wood"]
["51-7032","Patternmakers, Wood"]
["51-7041","Sawing Machine Setters, Operators, and Tenders, Wood"]
["51-7042","Woodworking Machine Setters, Operators, and Tenders, Except Sawing"]
["51-7099","Woodworkers, All Other"]
["51-8011","Nuclear Power Reactor Operators"]
["51-8012","Power Distributors and Dispatchers"]
["51-8013","Power Plant Operators"]
["51-8021","Stationary Engineers and Boiler Operators"]
["51-8031","Water and Wastewater Treatment Plant and System Operators"]
["51-8091","Chemical Plant and System Operators"]
["51-8092","Gas Plant Operators"]
["51-8093","Petroleum Pump System Operators, Refinery Operators, and Gaugers"]
["51-8099","Plant and System Operators, All Other"]
["51-9011","Chemical Equipment Operators and Tenders"]
["51-9012","Separating, Filtering, Clarifying, Precipitating, and Still Machine Setters, Operators, and Tenders"]
["51-9021","Crushing, Grinding, and Polishing Machine Setters, Operators, and Tenders"]
["51-9022","Grinding and Polishing Workers, Hand"]
["51-9023","Mixing and Blending Machine Setters, Operators, and Tenders"]
["51-9031","Cutters and Trimmers, Hand"]
["51-9032","Cutting and Slicing Machine Setters, Operators, and Tenders"]
["51-9041","Extruding, Forming, Pressing, and Compacting Machine Setters, Operators, and Tenders"]
["51-9051","Furnace, Kiln, Oven, Drier, and Kettle Operators and Tenders"]
["51-9061","Inspectors, Testers, Sorters, Samplers, and Weighers"]
["51-9071","Jewelers and Precious Stone and Metal Workers"]
["51-9081","Dental Laboratory Technicians"]
["51-9082","Medical Appliance Technicians"]
["51-9083","Ophthalmic Laboratory Technicians"]
["51-9111","Packaging and Filling Machine Operators and Tenders"]
["51-9121","Coating, Painting, and Spraying Machine Setters, Operators, and Tenders"]
["51-9122","Painters, Transportation Equipment"]
["51-9123","Painting, Coating, and Decorating Workers"]
["51-9151","Photographic Process Workers and Processing Machine Operators**"]
["51-9151","Photographic Process Workers and Processing Machine Operators**"]
["51-9141","Semiconductor Processors"]
["51-9191","Adhesive Bonding Machine Operators and Tenders"]
["51-9192","Cleaning, Washing, and Metal Pickling Equipment Operators and Tenders"]
["51-9193","Cooling and Freezing Equipment Operators and Tenders"]
["51-9194","Etchers and Engravers"]
["51-9195","Molders, Shapers, and Casters, Except Metal and Plastic"]
["51-9196","Paper Goods Machine Setters, Operators, and Tenders"]
["51-9197","Tire Builders"]
["51-9198","Helpers--Production Workers"]
["51-9199","Production Workers, All Other"]
["51-3099","Food Processing Workers, All Other"]
["53-1011","Aircraft Cargo Handling Supervisors"]
["53-1021","First-Line Supervisors of Helpers, Laborers, and Material Movers, Hand"]
["53-1031","First-Line Supervisors of Transportation and Material-Moving Machine and Vehicle Operators"]
["53-2011","Airline Pilots, Copilots, and Flight Engineers"]
["53-2012","Commercial Pilots"]
["53-2021","Air Traffic Controllers"]
["53-2022","Airfield Operations Specialists"]
["53-3011","Ambulance Drivers and Attendants, Except Emergency Medical Technicians"]
["53-3021","Bus Drivers, Transit and Intercity "]
["53-3022","Bus Drivers, School or Special Client "]
["53-3031","Driver/Sales Workers"]
["53-3032","Heavy and Tractor-Trailer Truck Drivers"]
["53-3033","Light Truck or Delivery Services Drivers"]
["53-3041","Taxi Drivers and Chauffeurs"]
["53-3099","Motor Vehicle Operators, All Other"]
["53-4011","Locomotive Engineers"]
["53-4012","Locomotive Firers"]
["53-4013","Rail Yard Engineers, Dinkey Operators, and Hostlers"]
["53-4021","Railroad Brake, Signal, and Switch Operators"]
["53-4031","Railroad Conductors and Yardmasters"]
["53-4041","Subway and Streetcar Operators"]
["53-4099","Rail Transportation Workers, All Other"]
["53-5011","Sailors and Marine Oilers"]
["53-5021","Captains, Mates, and Pilots of Water Vessels"]
["53-5022","Motorboat Operators"]
["53-5031","Ship Engineers"]
["53-6011","Bridge and Lock Tenders"]
["53-6021","Parking Lot Attendants"]
["53-6031","Automotive and Watercraft Service Attendants"]
["53-6041","Traffic Technicians"]
["53-6051","Transportation Inspectors"]
["53-6099","Transportation Workers, All Other"]
["53-7011","Conveyor Operators and Tenders"]
["53-7021","Crane and Tower Operators"]
["53-7031","Dredge Operators"]
["53-7032","Excavating and Loading Machine and Dragline Operators"]
["53-7033","Loading Machine Operators, Underground Mining"]
["53-7041","Hoist and Winch Operators"]
["53-7051","Industrial Truck and Tractor Operators"]
["53-7061","Cleaners of Vehicles and Equipment"]
["53-7062","Laborers and Freight, Stock, and Material Movers, Hand"]
["53-7063","Machine Feeders and Offbearers"]
["53-7064","Packers and Packagers, Hand"]
["53-7071","Gas Compressor and Gas Pumping Station Operators"]
["53-7072","Pump Operators, Except Wellhead Pumpers"]
["53-7073","Wellhead Pumpers"]
["53-7081","Refuse and Recyclable Material Collectors"]
["53-7111","Mine Shuttle Car Operators"]
["53-7121","Tank Car, Truck, and Ship Loaders"]
["53-7199","Material Moving Workers, All Other"]
["55-1011","Air Crew Officers"]
["55-1012","Aircraft Launch and Recovery Officers"]
["55-1013","Armored Assault Vehicle Officers"]
["55-1014","Artillery and Missile Officers"]
["55-1015","Command and Control Center Officers"]
["55-1016","Infantry Officers"]
["55-1017","Special Forces Officers"]
["55-1019","Military Officer Special and Tactical Operations Leaders, All Other"]
["55-2011","First-Line Supervisors of Air Crew Members"]
["55-2012","First-Line Supervisors of Weapons Specialists/Crew Members"]
["55-2013","First-Line Supervisors of All Other Tactical Operations Specialists"]
["55-3011","Air Crew Members"]
["55-3012","Aircraft Launch and Recovery Specialists"]
["55-3013","Armored Assault Vehicle Crew Members"]
["55-3014","Artillery and Missile Crew Members"]
["55-3015","Command and Control Center Specialists"]
["55-3016","Infantry"]
["55-3017","Radar and Sonar Technicians"]
["55-3018","Special Forces"]
["55-3019","Military Enlisted Tactical Operations and Air/Weapons Specialists and Crew Members, All Other"]